[#299692] [test-only] FAILED (try 3) gcc-defaults.git=11-alt2 gcc.git=TMP-12.1.1-alt1

Girar awaiter (glebfm) girar-builder at altlinux.org
Sun May 8 20:35:37 MSK 2022


https://git.altlinux.org/tasks/299692/logs/events.3.1.log

subtask  name  aarch64     armh    i586  ppc64le  x86_64
   #200  gcc   3:17:25  5:16:55  failed   failed  failed

2022-May-08 12:18:14 :: test-only task #299692 for sisyphus resumed by glebfm:
#40 build 11-alt2 from /people/glebfm/packages/gcc-defaults.git fetched at 2022-May-07 19:41:08
#100 removed
#200 build TMP-12.1.1-alt1 from /people/glebfm/packages/gcc.git fetched at 2022-May-08 12:16:44
2022-May-08 12:18:14 :: created build repo
2022-May-08 12:18:15 :: [ppc64le] #40 gcc-defaults.git 11-alt2: build start
2022-May-08 12:18:15 :: [i586] #40 gcc-defaults.git 11-alt2: build start
2022-May-08 12:18:15 :: [armh] #40 gcc-defaults.git 11-alt2: build start
2022-May-08 12:18:15 :: [aarch64] #40 gcc-defaults.git 11-alt2: build start
2022-May-08 12:18:15 :: [x86_64] #40 gcc-defaults.git 11-alt2: build start
2022-May-08 12:18:23 :: [i586] #40 gcc-defaults.git 11-alt2: build OK (cached)
2022-May-08 12:18:23 :: [i586] #200 gcc.git TMP-12.1.1-alt1: build start
2022-May-08 12:18:23 :: [x86_64] #40 gcc-defaults.git 11-alt2: build OK (cached)
2022-May-08 12:18:24 :: [x86_64] #200 gcc.git TMP-12.1.1-alt1: build start
2022-May-08 12:18:33 :: [aarch64] #40 gcc-defaults.git 11-alt2: build OK (cached)
2022-May-08 12:18:33 :: [aarch64] #200 gcc.git TMP-12.1.1-alt1: build start
2022-May-08 12:18:35 :: [ppc64le] #40 gcc-defaults.git 11-alt2: build OK (cached)
2022-May-08 12:18:36 :: [ppc64le] #200 gcc.git TMP-12.1.1-alt1: build start
2022-May-08 12:18:42 :: [armh] #40 gcc-defaults.git 11-alt2: build OK (cached)
2022-May-08 12:18:42 :: [armh] #200 gcc.git TMP-12.1.1-alt1: build start
[ppc64le] required isl version is 0.15 or later
[ppc64le] configure: error: GDC is required to build d
2022-May-08 12:24:07 :: [ppc64le] gcc.git TMP-12.1.1-alt1: remote: build failed
2022-May-08 12:24:07 :: [ppc64le] #200 gcc.git TMP-12.1.1-alt1: build FAILED
2022-May-08 12:24:07 :: [ppc64le] requesting cancellation of task processing
[x86_64] + rm libiberty.a
[x86_64] rm: cannot remove 'libiberty.a': No such file or directory
[x86_64] + mv libasan.a libatomic.a libgdruntime.a libgfortran.a libgo.a libgobegin.a libgolibbegin.a libgomp.a libgphobos.a libitm.a liblsan.a libobjc.a libquadmath.a libstdc++.a libstdc++fs.a libsupc++.a libtsan.a libubsan.a libvtv.a /usr/src/tmp/gcc12-buildroot/usr/lib64/gcc/x86_64-alt-linux/12/
2022-May-08 14:45:48 :: [x86_64] gcc.git TMP-12.1.1-alt1: remote: build failed
2022-May-08 14:45:48 :: [x86_64] #200 gcc.git TMP-12.1.1-alt1: build FAILED
[i586] + rm libiberty.a
[i586] rm: cannot remove 'libiberty.a': No such file or directory
[i586] + mv libasan.a libatomic.a libgdruntime.a libgfortran.a libgo.a libgobegin.a libgolibbegin.a libgomp.a libgphobos.a libitm.a libobjc.a libquadmath.a libstdc++.a libstdc++fs.a libsupc++.a libubsan.a libvtv.a /usr/src/tmp/gcc12-buildroot/usr/lib/gcc/i586-alt-linux/12/
2022-May-08 14:52:17 :: [i586] gcc.git TMP-12.1.1-alt1: remote: build failed
2022-May-08 14:52:17 :: [i586] #200 gcc.git TMP-12.1.1-alt1: build FAILED
2022-May-08 15:35:58 :: [aarch64] #200 gcc.git TMP-12.1.1-alt1: build OK
2022-May-08 17:35:37 :: [armh] #200 gcc.git TMP-12.1.1-alt1: build OK
2022-May-08 12:24:07 :: [ppc64le] build FAILED
2022-May-08 14:45:48 :: [x86_64] build FAILED
2022-May-08 14:52:17 :: [i586] build FAILED
2022-May-08 17:35:37 :: task #299692 for sisyphus FAILED


More information about the Sisyphus-incominger mailing list