[#296098] p10 FAILED (try 2) builder-useradd.git=1.3-alt1
Girar awaiter (antohami)
girar-builder at altlinux.org
Wed Mar 2 19:55:31 MSK 2022
https://git.altlinux.org/tasks/296098/logs/events.2.1.log
subtask name aarch64 armh i586 ppc64le x86_64
#100 builder-useradd 17 28 10 20 10
2022-Mar-02 16:54:55 :: task #296098 for p10 resumed by antohami:
2022-Mar-02 16:54:55 :: message: fix_generated_source_list_for_riscv64_sisyphus
#100 build 1.3-alt1 from /gears/b/builder-useradd.git fetched at 2022-Mar-02 13:03:47 from sisyphus
2022-Mar-02 16:54:56 :: [i586] #100 builder-useradd.git 1.3-alt1: build start
2022-Mar-02 16:54:56 :: [armh] #100 builder-useradd.git 1.3-alt1: build start
2022-Mar-02 16:54:56 :: [aarch64] #100 builder-useradd.git 1.3-alt1: build start
2022-Mar-02 16:54:56 :: [x86_64] #100 builder-useradd.git 1.3-alt1: build start
2022-Mar-02 16:54:56 :: [ppc64le] #100 builder-useradd.git 1.3-alt1: build start
2022-Mar-02 16:55:06 :: [x86_64] #100 builder-useradd.git 1.3-alt1: build OK
2022-Mar-02 16:55:06 :: [i586] #100 builder-useradd.git 1.3-alt1: build OK
2022-Mar-02 16:55:13 :: [aarch64] #100 builder-useradd.git 1.3-alt1: build OK
2022-Mar-02 16:55:16 :: [ppc64le] #100 builder-useradd.git 1.3-alt1: build OK
2022-Mar-02 16:55:24 :: [armh] #100 builder-useradd.git 1.3-alt1: build OK
armh/rpms/builder-useradd-1.3-alt1.noarch.rpm: BUILDTIME in the future: Wed Mar 2 16:55:34 UTC 2022
sisyphus_check: check-buildtime ERROR: buildtime violation
2022-Mar-02 16:55:30 :: #100: builder-useradd.git 1.3-alt1: sisyphus_check FAILED
2022-Mar-02 16:55:31 :: build check FAILED for: #100
2022-Mar-02 16:55:31 :: task #296098 for p10 FAILED
More information about the Sisyphus-incominger
mailing list