[#302682] FAILED perl-Archive-Zip-SimpleZip.git=1.000-alt1

Girar awaiter (viy) girar-builder at altlinux.org
Mon Jun 27 12:05:55 MSK 2022


https://git.altlinux.org/tasks/302682/logs/events.1.1.log

subtask  name                        aarch64    armh    i586  ppc64le  x86_64
   #100  perl-Archive-Zip-SimpleZip   failed  failed  failed   failed  failed

2022-Jun-27 09:05:17 :: task #302682 for sisyphus started by viy:
#100 build 1.000-alt1 from /people/viy/packages/perl-Archive-Zip-SimpleZip.git fetched at 2022-Jun-27 09:05:14
2022-Jun-27 09:05:18 :: [x86_64] #100 perl-Archive-Zip-SimpleZip.git 1.000-alt1: build start
2022-Jun-27 09:05:18 :: [armh] #100 perl-Archive-Zip-SimpleZip.git 1.000-alt1: build start
2022-Jun-27 09:05:18 :: [aarch64] #100 perl-Archive-Zip-SimpleZip.git 1.000-alt1: build start
2022-Jun-27 09:05:18 :: [ppc64le] #100 perl-Archive-Zip-SimpleZip.git 1.000-alt1: build start
2022-Jun-27 09:05:18 :: [i586] #100 perl-Archive-Zip-SimpleZip.git 1.000-alt1: build start
[x86_64] #     expected: ''
[x86_64] #     Failed test (t/111const-deflate.t at line 95)
[x86_64] #          got: 'Bareword "Z_NO_COMPRESSION" not allowed while "strict subs" in use at (eval 148) line 1.
[x86_64] #     expected: ''
[x86_64] #     Failed test (t/111const-deflate.t at line 95)
[x86_64] #          got: 'Bareword "Z_BEST_SPEED" not allowed while "strict subs" in use at (eval 150) line 1.
[x86_64] #     expected: ''
[x86_64] #     Failed test (t/111const-deflate.t at line 95)
[x86_64] #          got: 'Bareword "Z_BEST_COMPRESSION" not allowed while "strict subs" in use at (eval 152) line 1.
[x86_64] #     expected: ''
[x86_64] #     Failed test (t/111const-deflate.t at line 95)
[x86_64] #          got: 'Bareword "Z_DEFAULT_COMPRESSION" not allowed while "strict subs" in use at (eval 154) line 1.
[x86_64] #     expected: ''
[x86_64] #     Failed test (t/111const-deflate.t at line 88)
[x86_64] #          got: 'Attempt to reload Archive/Zip/SimpleZip.pm aborted.
[x86_64] # Compilation failed in require at (eval 156) line 5.
[x86_64] # BEGIN failed--compilation aborted at (eval 156) line 5.
[x86_64] #     expected: ''
[x86_64] #     Failed test (t/111const-deflate.t at line 95)
[x86_64] #          got: 'Bareword "Z_OK" not allowed while "strict subs" in use at (eval 158) line 1.
[x86_64] #     expected: ''
[x86_64] #     Failed test (t/111const-deflate.t at line 95)
[x86_64] #          got: 'Bareword "Z_STREAM_END" not allowed while "strict subs" in use at (eval 160) line 1.
[x86_64] #     expected: ''
[x86_64] #     Failed test (t/111const-deflate.t at line 95)
[x86_64] #          got: 'Bareword "Z_NEED_DICT" not allowed while "strict subs" in use at (eval 162) line 1.
[x86_64] #     expected: ''
[x86_64] #     Failed test (t/111const-deflate.t at line 95)
[x86_64] #          got: 'Bareword "Z_ERRNO" not allowed while "strict subs" in use at (eval 164) line 1.
2022-Jun-27 09:05:30 :: [x86_64] perl-Archive-Zip-SimpleZip.git 1.000-alt1: remote: build failed
2022-Jun-27 09:05:30 :: [x86_64] #100 perl-Archive-Zip-SimpleZip.git 1.000-alt1: build FAILED
2022-Jun-27 09:05:30 :: [x86_64] requesting cancellation of task processing
[i586] #     expected: ''
[i586] #     Failed test (t/111const-deflate.t at line 95)
[i586] #          got: 'Bareword "Z_NO_COMPRESSION" not allowed while "strict subs" in use at (eval 148) line 1.
[i586] #     expected: ''
[i586] #     Failed test (t/111const-deflate.t at line 95)
[i586] #          got: 'Bareword "Z_BEST_SPEED" not allowed while "strict subs" in use at (eval 150) line 1.
[i586] #     expected: ''
[i586] #     Failed test (t/111const-deflate.t at line 95)
[i586] #          got: 'Bareword "Z_BEST_COMPRESSION" not allowed while "strict subs" in use at (eval 152) line 1.
[i586] #     expected: ''
[i586] #     Failed test (t/111const-deflate.t at line 95)
[i586] #          got: 'Bareword "Z_DEFAULT_COMPRESSION" not allowed while "strict subs" in use at (eval 154) line 1.
[i586] #     expected: ''
[i586] #     Failed test (t/111const-deflate.t at line 88)
[i586] #          got: 'Attempt to reload Archive/Zip/SimpleZip.pm aborted.
[i586] # Compilation failed in require at (eval 156) line 5.
[i586] # BEGIN failed--compilation aborted at (eval 156) line 5.
[i586] #     expected: ''
[i586] #     Failed test (t/111const-deflate.t at line 95)
[i586] #          got: 'Bareword "Z_OK" not allowed while "strict subs" in use at (eval 158) line 1.
[i586] #     expected: ''
[i586] #     Failed test (t/111const-deflate.t at line 95)
[i586] #          got: 'Bareword "Z_STREAM_END" not allowed while "strict subs" in use at (eval 160) line 1.
[i586] #     expected: ''
[i586] #     Failed test (t/111const-deflate.t at line 95)
[i586] #          got: 'Bareword "Z_NEED_DICT" not allowed while "strict subs" in use at (eval 162) line 1.
[i586] #     expected: ''
[i586] #     Failed test (t/111const-deflate.t at line 95)
[i586] #          got: 'Bareword "Z_ERRNO" not allowed while "strict subs" in use at (eval 164) line 1.
2022-Jun-27 09:05:30 :: [i586] perl-Archive-Zip-SimpleZip.git 1.000-alt1: remote: build failed
2022-Jun-27 09:05:30 :: [i586] #100 perl-Archive-Zip-SimpleZip.git 1.000-alt1: build FAILED
[aarch64] #     expected: ''
[aarch64] #     Failed test (t/111const-deflate.t at line 95)
[aarch64] #          got: 'Bareword "Z_NO_FLUSH" not allowed while "strict subs" in use at (eval 148) line 1.
[aarch64] #     expected: ''
[aarch64] #     Failed test (t/111const-deflate.t at line 95)
[aarch64] #          got: 'Bareword "Z_PARTIAL_FLUSH" not allowed while "strict subs" in use at (eval 150) line 1.
[aarch64] #     expected: ''
[aarch64] #     Failed test (t/111const-deflate.t at line 95)
[aarch64] #          got: 'Bareword "Z_SYNC_FLUSH" not allowed while "strict subs" in use at (eval 152) line 1.
[aarch64] #     expected: ''
[aarch64] #     Failed test (t/111const-deflate.t at line 95)
[aarch64] #          got: 'Bareword "Z_FULL_FLUSH" not allowed while "strict subs" in use at (eval 154) line 1.
[aarch64] #     expected: ''
[aarch64] #     Failed test (t/111const-deflate.t at line 95)
[aarch64] #          got: 'Bareword "Z_FINISH" not allowed while "strict subs" in use at (eval 156) line 1.
[aarch64] #     expected: ''
[aarch64] #     Failed test (t/111const-deflate.t at line 95)
[aarch64] #          got: 'Bareword "Z_BLOCK" not allowed while "strict subs" in use at (eval 158) line 1.
[aarch64] #     expected: ''
[aarch64] #     Failed test (t/111const-deflate.t at line 88)
[aarch64] #          got: 'Attempt to reload Archive/Zip/SimpleZip.pm aborted.
[aarch64] # Compilation failed in require at (eval 160) line 5.
[aarch64] # BEGIN failed--compilation aborted at (eval 160) line 5.
[aarch64] #     expected: ''
[aarch64] #     Failed test (t/111const-deflate.t at line 95)
[aarch64] #          got: 'Bareword "Z_FILTERED" not allowed while "strict subs" in use at (eval 162) line 1.
[aarch64] #     expected: ''
[aarch64] #     Failed test (t/111const-deflate.t at line 95)
[aarch64] #          got: 'Bareword "Z_HUFFMAN_ONLY" not allowed while "strict subs" in use at (eval 164) line 1.
2022-Jun-27 09:05:42 :: [aarch64] perl-Archive-Zip-SimpleZip.git 1.000-alt1: remote: build failed
2022-Jun-27 09:05:42 :: [aarch64] #100 perl-Archive-Zip-SimpleZip.git 1.000-alt1: build FAILED
[ppc64le] #     expected: ''
[ppc64le] #     Failed test (t/111const-deflate.t at line 95)
[ppc64le] #          got: 'Bareword "Z_FILTERED" not allowed while "strict subs" in use at (eval 148) line 1.
[ppc64le] #     expected: ''
[ppc64le] #     Failed test (t/111const-deflate.t at line 95)
[ppc64le] #          got: 'Bareword "Z_HUFFMAN_ONLY" not allowed while "strict subs" in use at (eval 150) line 1.
[ppc64le] #     expected: ''
[ppc64le] #     Failed test (t/111const-deflate.t at line 95)
[ppc64le] #          got: 'Bareword "Z_RLE" not allowed while "strict subs" in use at (eval 152) line 1.
[ppc64le] #     expected: ''
[ppc64le] #     Failed test (t/111const-deflate.t at line 95)
[ppc64le] #          got: 'Bareword "Z_FIXED" not allowed while "strict subs" in use at (eval 154) line 1.
[ppc64le] #     expected: ''
[ppc64le] #     Failed test (t/111const-deflate.t at line 95)
[ppc64le] #          got: 'Bareword "Z_DEFAULT_STRATEGY" not allowed while "strict subs" in use at (eval 156) line 1.
[ppc64le] #     expected: ''
[ppc64le] #     Failed test (t/111const-deflate.t at line 88)
[ppc64le] #          got: 'Attempt to reload Archive/Zip/SimpleZip.pm aborted.
[ppc64le] # Compilation failed in require at (eval 158) line 5.
[ppc64le] # BEGIN failed--compilation aborted at (eval 158) line 5.
[ppc64le] #     expected: ''
[ppc64le] #     Failed test (t/111const-deflate.t at line 95)
[ppc64le] #          got: 'Bareword "Z_NO_FLUSH" not allowed while "strict subs" in use at (eval 160) line 1.
[ppc64le] #     expected: ''
[ppc64le] #     Failed test (t/111const-deflate.t at line 95)
[ppc64le] #          got: 'Bareword "Z_PARTIAL_FLUSH" not allowed while "strict subs" in use at (eval 162) line 1.
[ppc64le] #     expected: ''
[ppc64le] #     Failed test (t/111const-deflate.t at line 95)
[ppc64le] #          got: 'Bareword "Z_SYNC_FLUSH" not allowed while "strict subs" in use at (eval 164) line 1.
2022-Jun-27 09:05:45 :: [ppc64le] perl-Archive-Zip-SimpleZip.git 1.000-alt1: remote: build failed
2022-Jun-27 09:05:45 :: [ppc64le] #100 perl-Archive-Zip-SimpleZip.git 1.000-alt1: build FAILED
[armh] #     expected: ''
[armh] #     Failed test (t/111const-deflate.t at line 95)
[armh] #          got: 'Bareword "Z_NO_FLUSH" not allowed while "strict subs" in use at (eval 148) line 1.
[armh] #     expected: ''
[armh] #     Failed test (t/111const-deflate.t at line 95)
[armh] #          got: 'Bareword "Z_PARTIAL_FLUSH" not allowed while "strict subs" in use at (eval 150) line 1.
[armh] #     expected: ''
[armh] #     Failed test (t/111const-deflate.t at line 95)
[armh] #          got: 'Bareword "Z_SYNC_FLUSH" not allowed while "strict subs" in use at (eval 152) line 1.
[armh] #     expected: ''
[armh] #     Failed test (t/111const-deflate.t at line 95)
[armh] #          got: 'Bareword "Z_FULL_FLUSH" not allowed while "strict subs" in use at (eval 154) line 1.
[armh] #     expected: ''
[armh] #     Failed test (t/111const-deflate.t at line 95)
[armh] #          got: 'Bareword "Z_FINISH" not allowed while "strict subs" in use at (eval 156) line 1.
[armh] #     expected: ''
[armh] #     Failed test (t/111const-deflate.t at line 95)
[armh] #          got: 'Bareword "Z_BLOCK" not allowed while "strict subs" in use at (eval 158) line 1.
[armh] #     expected: ''
[armh] #     Failed test (t/111const-deflate.t at line 88)
[armh] #          got: 'Attempt to reload Archive/Zip/SimpleZip.pm aborted.
[armh] # Compilation failed in require at (eval 160) line 5.
[armh] # BEGIN failed--compilation aborted at (eval 160) line 5.
[armh] #     expected: ''
[armh] #     Failed test (t/111const-deflate.t at line 95)
[armh] #          got: 'Bareword "Z_FILTERED" not allowed while "strict subs" in use at (eval 162) line 1.
[armh] #     expected: ''
[armh] #     Failed test (t/111const-deflate.t at line 95)
[armh] #          got: 'Bareword "Z_HUFFMAN_ONLY" not allowed while "strict subs" in use at (eval 164) line 1.
2022-Jun-27 09:05:55 :: [armh] perl-Archive-Zip-SimpleZip.git 1.000-alt1: remote: build failed
2022-Jun-27 09:05:55 :: [armh] #100 perl-Archive-Zip-SimpleZip.git 1.000-alt1: build FAILED
2022-Jun-27 09:05:30 :: [x86_64] build FAILED
2022-Jun-27 09:05:30 :: [i586] build FAILED
2022-Jun-27 09:05:42 :: [aarch64] build FAILED
2022-Jun-27 09:05:45 :: [ppc64le] build FAILED
2022-Jun-27 09:05:55 :: [armh] build FAILED
2022-Jun-27 09:05:55 :: task #302682 for sisyphus FAILED


More information about the Sisyphus-incominger mailing list