[#311312] [test-only] FAILED wine-vanilla.git=7.21-alt1

Girar awaiter (lav) girar-builder at altlinux.org
Wed Dec 7 03:48:31 MSK 2022


https://git.altlinux.org/tasks/311312/logs/events.1.1.log

subtask  name          aarch64  armh    i586  ppc64le  x86_64
   #100  wine-vanilla   failed     -  failed        -  failed

2022-Dec-07 00:36:45 :: test-only task #311312 for sisyphus started by lav:
#100 build 7.21-alt1 from /people/lav/packages/wine-vanilla.git fetched at 2022-Dec-07 00:36:43
2022-Dec-07 00:36:47 :: [aarch64] #100 wine-vanilla.git 7.21-alt1: build start
2022-Dec-07 00:36:47 :: [i586] #100 wine-vanilla.git 7.21-alt1: build start
2022-Dec-07 00:36:47 :: [armh] #100 wine-vanilla.git 7.21-alt1: build start
2022-Dec-07 00:36:47 :: [x86_64] #100 wine-vanilla.git 7.21-alt1: build start
2022-Dec-07 00:36:47 :: [ppc64le] #100 wine-vanilla.git 7.21-alt1: build start
2022-Dec-07 00:37:19 :: [ppc64le] #100 wine-vanilla.git 7.21-alt1: build SKIPPED
2022-Dec-07 00:37:29 :: [armh] #100 wine-vanilla.git 7.21-alt1: build SKIPPED
[x86_64] In file included from /usr/src/tmp/wine-vanilla-buildroot/usr/include/wine/msvcrt/wctype.h:23:
[x86_64] /usr/src/tmp/wine-vanilla-buildroot/usr/include/wine/msvcrt/corecrt.h:52:10: fatal error: sal.h: No such file or directory
[x86_64]    52 | #include <sal.h>
[x86_64] --
[x86_64] In file included from /usr/src/tmp/wine-vanilla-buildroot/usr/include/wine/msvcrt/complex.h:9:
[x86_64] /usr/src/tmp/wine-vanilla-buildroot/usr/include/wine/msvcrt/corecrt.h:52:10: fatal error: sal.h: No such file or directory
[x86_64]    52 | #include <sal.h>
[x86_64] --
[x86_64] cpp.req: WARNING: /usr/src/tmp/wine-vanilla-buildroot/usr/include/wine/msvcrt/complex.h: cpp failed
[x86_64] /usr/src/tmp/wine-vanilla-buildroot/usr/include/wine/msvcrt/corecrt.h:52:10: fatal error: sal.h: No such file or directory
[x86_64]    52 | #include <sal.h>
[x86_64] --
[x86_64] In file included from /usr/src/tmp/wine-vanilla-buildroot/usr/include/wine/msvcrt/crtdefs.h:24:
[x86_64] /usr/src/tmp/wine-vanilla-buildroot/usr/include/wine/msvcrt/corecrt.h:52:10: fatal error: sal.h: No such file or directory
[x86_64]    52 | #include <sal.h>
[x86_64] --
[x86_64] In file included from /usr/src/tmp/wine-vanilla-buildroot/usr/include/wine/msvcrt/mbctype.h:23:
[x86_64] /usr/src/tmp/wine-vanilla-buildroot/usr/include/wine/msvcrt/corecrt.h:52:10: fatal error: sal.h: No such file or directory
[x86_64]    52 | #include <sal.h>
[x86_64] --
[x86_64]                  from /usr/src/tmp/wine-vanilla-buildroot/usr/include/wine/msvcrt/process.h:11:
[x86_64] /usr/src/tmp/wine-vanilla-buildroot/usr/include/wine/msvcrt/corecrt.h:52:10: fatal error: sal.h: No such file or directory
[x86_64]    52 | #include <sal.h>
[x86_64] --
[x86_64] In file included from /usr/src/tmp/wine-vanilla-buildroot/usr/include/wine/msvcrt/inttypes.h:11:
[x86_64] /usr/src/tmp/wine-vanilla-buildroot/usr/include/wine/msvcrt/corecrt.h:52:10: fatal error: sal.h: No such file or directory
[x86_64]    52 | #include <sal.h>
[x86_64] --
[x86_64] In file included from /usr/src/tmp/wine-vanilla-buildroot/usr/include/wine/msvcrt/mbstring.h:23:
[x86_64] /usr/src/tmp/wine-vanilla-buildroot/usr/include/wine/msvcrt/corecrt.h:52:10: fatal error: sal.h: No such file or directory
[x86_64]    52 | #include <sal.h>
[x86_64] --
[x86_64]                  from /usr/src/tmp/wine-vanilla-buildroot/usr/include/wine/msvcrt/corecrt_io.h:9:
[x86_64] /usr/src/tmp/wine-vanilla-buildroot/usr/include/wine/msvcrt/corecrt.h:52:10: fatal error: sal.h: No such file or directory
[x86_64]    52 | #include <sal.h>
[x86_64] --
[x86_64] In file included from /usr/src/tmp/wine-vanilla-buildroot/usr/include/wine/msvcrt/corecrt_wio.h:9:
[x86_64] /usr/src/tmp/wine-vanilla-buildroot/usr/include/wine/msvcrt/corecrt.h:52:10: fatal error: sal.h: No such file or directory
[x86_64]    52 | #include <sal.h>
2022-Dec-07 00:41:36 :: [x86_64] wine-vanilla.git 7.21-alt1: remote: build failed
2022-Dec-07 00:41:36 :: [x86_64] #100 wine-vanilla.git 7.21-alt1: build FAILED
2022-Dec-07 00:41:36 :: [x86_64] requesting cancellation of task processing
[aarch64] Processing files: wine-vanilla-7.21-alt1
[aarch64] error: No such file or directory: /usr/src/tmp/wine-vanilla-buildroot/usr/lib/wine/wine64
[aarch64] error: No such file or directory: /usr/src/tmp/wine-vanilla-buildroot/usr/lib/wine/wine64-preloader
[aarch64] RPM build errors:
[aarch64]     No such file or directory: /usr/src/tmp/wine-vanilla-buildroot/usr/lib/wine/wine64
[aarch64]     No such file or directory: /usr/src/tmp/wine-vanilla-buildroot/usr/lib/wine/wine64-preloader
2022-Dec-07 00:43:32 :: [aarch64] wine-vanilla.git 7.21-alt1: remote: build failed
2022-Dec-07 00:43:32 :: [aarch64] #100 wine-vanilla.git 7.21-alt1: build FAILED
[i586] In file included from /usr/src/tmp/wine-vanilla-buildroot/usr/include/wine/msvcrt/wctype.h:23:
[i586] /usr/src/tmp/wine-vanilla-buildroot/usr/include/wine/msvcrt/corecrt.h:52:10: fatal error: sal.h: No such file or directory
[i586]    52 | #include <sal.h>
[i586] --
[i586] In file included from /usr/src/tmp/wine-vanilla-buildroot/usr/include/wine/msvcrt/complex.h:9:
[i586] /usr/src/tmp/wine-vanilla-buildroot/usr/include/wine/msvcrt/corecrt.h:52:10: fatal error: sal.h: No such file or directory
[i586]    52 | #include <sal.h>
[i586] --
[i586] cpp.req: WARNING: /usr/src/tmp/wine-vanilla-buildroot/usr/include/wine/msvcrt/complex.h: cpp failed
[i586] /usr/src/tmp/wine-vanilla-buildroot/usr/include/wine/msvcrt/corecrt.h:52:10: fatal error: sal.h: No such file or directory
[i586]    52 | #include <sal.h>
[i586] --
[i586] In file included from /usr/src/tmp/wine-vanilla-buildroot/usr/include/wine/msvcrt/crtdefs.h:24:
[i586] /usr/src/tmp/wine-vanilla-buildroot/usr/include/wine/msvcrt/corecrt.h:52:10: fatal error: sal.h: No such file or directory
[i586]    52 | #include <sal.h>
[i586] --
[i586] In file included from /usr/src/tmp/wine-vanilla-buildroot/usr/include/wine/msvcrt/mbctype.h:23:
[i586] /usr/src/tmp/wine-vanilla-buildroot/usr/include/wine/msvcrt/corecrt.h:52:10: fatal error: sal.h: No such file or directory
[i586]    52 | #include <sal.h>
[i586] --
[i586]                  from /usr/src/tmp/wine-vanilla-buildroot/usr/include/wine/msvcrt/process.h:11:
[i586] /usr/src/tmp/wine-vanilla-buildroot/usr/include/wine/msvcrt/corecrt.h:52:10: fatal error: sal.h: No such file or directory
[i586]    52 | #include <sal.h>
[i586] --
[i586] In file included from /usr/src/tmp/wine-vanilla-buildroot/usr/include/wine/msvcrt/inttypes.h:11:
[i586] /usr/src/tmp/wine-vanilla-buildroot/usr/include/wine/msvcrt/corecrt.h:52:10: fatal error: sal.h: No such file or directory
[i586]    52 | #include <sal.h>
[i586] --
[i586] In file included from /usr/src/tmp/wine-vanilla-buildroot/usr/include/wine/msvcrt/mbstring.h:23:
[i586] /usr/src/tmp/wine-vanilla-buildroot/usr/include/wine/msvcrt/corecrt.h:52:10: fatal error: sal.h: No such file or directory
[i586]    52 | #include <sal.h>
[i586] --
[i586]                  from /usr/src/tmp/wine-vanilla-buildroot/usr/include/wine/msvcrt/corecrt_io.h:9:
[i586] /usr/src/tmp/wine-vanilla-buildroot/usr/include/wine/msvcrt/corecrt.h:52:10: fatal error: sal.h: No such file or directory
[i586]    52 | #include <sal.h>
[i586] --
[i586] In file included from /usr/src/tmp/wine-vanilla-buildroot/usr/include/wine/msvcrt/corecrt_wio.h:9:
[i586] /usr/src/tmp/wine-vanilla-buildroot/usr/include/wine/msvcrt/corecrt.h:52:10: fatal error: sal.h: No such file or directory
[i586]    52 | #include <sal.h>
2022-Dec-07 00:48:31 :: [i586] wine-vanilla.git 7.21-alt1: remote: build failed
2022-Dec-07 00:48:31 :: [i586] #100 wine-vanilla.git 7.21-alt1: build FAILED
2022-Dec-07 00:41:36 :: [x86_64] build FAILED
2022-Dec-07 00:43:32 :: [aarch64] build FAILED
2022-Dec-07 00:48:31 :: [i586] build FAILED
2022-Dec-07 00:48:31 :: task #311312 for sisyphus FAILED


More information about the Sisyphus-incominger mailing list