[#310989] FAILED (try 2) srpm=perl-Feature-Compat-Try-0.05-alt1.1.src.rpm

Girar awaiter (viy) girar-builder at altlinux.org
Fri Dec 2 07:01:11 MSK 2022


https://git.altlinux.org/tasks/310989/logs/events.2.1.log

subtask  name                     aarch64  armh    i586  ppc64le  x86_64
   #100  perl-Feature-Compat-Try   failed     -  failed   failed  failed

2022-Dec-02 04:00:46 :: task #310989 for sisyphus resumed by viy:
#100 build perl-Feature-Compat-Try-0.05-alt1.1.src.rpm
2022-Dec-02 04:00:47 :: #100: force rebuild
2022-Dec-02 04:00:47 :: [armh] #100 perl-Feature-Compat-Try-0.05-alt1.1.src.rpm: build start
2022-Dec-02 04:00:47 :: [x86_64] #100 perl-Feature-Compat-Try-0.05-alt1.1.src.rpm: build start
2022-Dec-02 04:00:47 :: [i586] #100 perl-Feature-Compat-Try-0.05-alt1.1.src.rpm: build start
2022-Dec-02 04:00:47 :: [aarch64] #100 perl-Feature-Compat-Try-0.05-alt1.1.src.rpm: build start
2022-Dec-02 04:00:47 :: [ppc64le] #100 perl-Feature-Compat-Try-0.05-alt1.1.src.rpm: build start
[x86_64] warning: user igor does not exist - using root
[x86_64] warning: group igor does not exist - using root
[x86_64] warning: user igor does not exist - using root
[x86_64] warning: group igor does not exist - using root
[x86_64] Reading Package Lists...
[x86_64] Building Dependency Tree...
[x86_64] E: Couldn't find package perl(Future/AsyncAwait.pm)
[x86_64] hsh-install: Failed to calculate package file list.
[x86_64] hsh-install: Failed to generate package file list.
2022-Dec-02 04:00:55 :: [x86_64] perl-Feature-Compat-Try-0.05-alt1.1.src.rpm: remote: cannot build src.rpm
2022-Dec-02 04:00:55 :: [x86_64] #100 perl-Feature-Compat-Try-0.05-alt1.1.src.rpm: build FAILED
2022-Dec-02 04:00:55 :: [x86_64] requesting cancellation of task processing
[i586] warning: user igor does not exist - using root
[i586] warning: group igor does not exist - using root
[i586] warning: user igor does not exist - using root
[i586] warning: group igor does not exist - using root
[i586] Reading Package Lists...
[i586] Building Dependency Tree...
[i586] E: Couldn't find package perl(Future/AsyncAwait.pm)
[i586] hsh-install: Failed to calculate package file list.
[i586] hsh-install: Failed to generate package file list.
2022-Dec-02 04:00:55 :: [i586] perl-Feature-Compat-Try-0.05-alt1.1.src.rpm: remote: cannot build src.rpm
2022-Dec-02 04:00:55 :: [i586] #100 perl-Feature-Compat-Try-0.05-alt1.1.src.rpm: build FAILED
[aarch64] warning: user igor does not exist - using root
[aarch64] warning: group igor does not exist - using root
[aarch64] warning: user igor does not exist - using root
[aarch64] warning: group igor does not exist - using root
[aarch64] Reading Package Lists...
[aarch64] Building Dependency Tree...
[aarch64] E: Couldn't find package perl(Future/AsyncAwait.pm)
[aarch64] hsh-install: Failed to calculate package file list.
[aarch64] hsh-install: Failed to generate package file list.
2022-Dec-02 04:01:02 :: [aarch64] perl-Feature-Compat-Try-0.05-alt1.1.src.rpm: remote: cannot build src.rpm
2022-Dec-02 04:01:02 :: [aarch64] #100 perl-Feature-Compat-Try-0.05-alt1.1.src.rpm: build FAILED
[ppc64le] warning: user igor does not exist - using root
[ppc64le] warning: group igor does not exist - using root
[ppc64le] warning: user igor does not exist - using root
[ppc64le] warning: group igor does not exist - using root
[ppc64le] Reading Package Lists...
[ppc64le] Building Dependency Tree...
[ppc64le] E: Couldn't find package perl(Future/AsyncAwait.pm)
[ppc64le] hsh-install: Failed to calculate package file list.
[ppc64le] hsh-install: Failed to generate package file list.
2022-Dec-02 04:01:04 :: [ppc64le] perl-Feature-Compat-Try-0.05-alt1.1.src.rpm: remote: cannot build src.rpm
2022-Dec-02 04:01:04 :: [ppc64le] #100 perl-Feature-Compat-Try-0.05-alt1.1.src.rpm: build FAILED
[armh] warning: user igor does not exist - using root
[armh] warning: group igor does not exist - using root
[armh] warning: user igor does not exist - using root
[armh] warning: group igor does not exist - using root
[armh] Reading Package Lists...
[armh] Building Dependency Tree...
[armh] E: Couldn't find package perl(Future/AsyncAwait.pm)
[armh] hsh-install: Failed to calculate package file list.
[armh] hsh-install: Failed to generate package file list.
2022-Dec-02 04:01:11 :: [armh] perl-Feature-Compat-Try-0.05-alt1.1.src.rpm: remote: cannot build src.rpm, but we don't care
2022-Dec-02 04:01:11 :: [armh] #100 perl-Feature-Compat-Try-0.05-alt1.1.src.rpm: build SKIPPED
2022-Dec-02 04:00:55 :: [x86_64] build FAILED
2022-Dec-02 04:00:55 :: [i586] build FAILED
2022-Dec-02 04:01:02 :: [aarch64] build FAILED
2022-Dec-02 04:01:04 :: [ppc64le] build FAILED
2022-Dec-02 04:01:11 :: task #310989 for sisyphus FAILED


More information about the Sisyphus-incominger mailing list