[#286567] [test-only] FAILED (try 6) libtdb.git=1.4.4-alt1 libtalloc.git=2.3.3-alt1 cmocka.git=1.1.5-alt1 ...

Girar awaiter (sin) girar-builder at altlinux.org
Fri Oct 8 06:04:40 MSK 2021


http://git.altlinux.org/tasks/286567/logs/events.6.1.log

subtask  name    aarch64    armh    i586  ppc64le  x86_64
   #540  libldb     3:58  failed  failed     4:23    3:23

2021-Oct-08 02:58:46 :: test-only task #286567 for sisyphus resumed by sin:
#100 build 1.4.4-alt1 from /people/sin/packages/libtdb.git fetched at 2021-Oct-07 00:56:00
#200 build 2.3.3-alt1 from /people/sin/packages/libtalloc.git fetched at 2021-Oct-07 01:05:04
#300 build 1.1.5-alt1 from /people/sin/packages/cmocka.git fetched at 2021-Oct-07 01:52:20
#400 build 0.11.0-alt1 from /people/sin/packages/libtevent.git fetched at 2021-Oct-07 02:04:48
#500 removed
#540 build 2.4.0-alt2 from /people/sin/packages/libldb.git fetched at 2021-Oct-08 02:53:36
#600 removed
#700 build 4.15.0-alt1 from /people/sin/packages/samba.git fetched at 2021-Oct-08 01:31:46
2021-Oct-08 02:58:47 :: created build repo
2021-Oct-08 02:58:47 :: [ppc64le] #100 libtdb.git 1.4.4-alt1: build start
2021-Oct-08 02:58:47 :: [armh] #100 libtdb.git 1.4.4-alt1: build start
2021-Oct-08 02:58:47 :: [aarch64] #100 libtdb.git 1.4.4-alt1: build start
2021-Oct-08 02:58:47 :: [x86_64] #100 libtdb.git 1.4.4-alt1: build start
2021-Oct-08 02:58:47 :: [i586] #100 libtdb.git 1.4.4-alt1: build start
2021-Oct-08 02:59:06 :: [i586] #100 libtdb.git 1.4.4-alt1: build OK (cached)
2021-Oct-08 02:59:06 :: [i586] #200 libtalloc.git 2.3.3-alt1: build start
2021-Oct-08 02:59:07 :: [x86_64] #100 libtdb.git 1.4.4-alt1: build OK (cached)
2021-Oct-08 02:59:07 :: [x86_64] #200 libtalloc.git 2.3.3-alt1: build start
2021-Oct-08 02:59:10 :: [aarch64] #100 libtdb.git 1.4.4-alt1: build OK (cached)
2021-Oct-08 02:59:10 :: [aarch64] #200 libtalloc.git 2.3.3-alt1: build start
2021-Oct-08 02:59:16 :: [ppc64le] #100 libtdb.git 1.4.4-alt1: build OK (cached)
2021-Oct-08 02:59:16 :: [ppc64le] #200 libtalloc.git 2.3.3-alt1: build start
2021-Oct-08 02:59:20 :: [armh] #100 libtdb.git 1.4.4-alt1: build OK (cached)
2021-Oct-08 02:59:20 :: [armh] #200 libtalloc.git 2.3.3-alt1: build start
2021-Oct-08 02:59:21 :: [x86_64] #200 libtalloc.git 2.3.3-alt1: build OK (cached)
2021-Oct-08 02:59:21 :: [x86_64] #300 cmocka.git 1.1.5-alt1: build start
2021-Oct-08 02:59:21 :: [i586] #200 libtalloc.git 2.3.3-alt1: build OK (cached)
2021-Oct-08 02:59:21 :: [i586] #300 cmocka.git 1.1.5-alt1: build start
2021-Oct-08 02:59:27 :: [aarch64] #200 libtalloc.git 2.3.3-alt1: build OK (cached)
2021-Oct-08 02:59:27 :: [aarch64] #300 cmocka.git 1.1.5-alt1: build start
2021-Oct-08 02:59:35 :: [x86_64] #300 cmocka.git 1.1.5-alt1: build OK (cached)
2021-Oct-08 02:59:35 :: [x86_64] #400 libtevent.git 0.11.0-alt1: build start
2021-Oct-08 02:59:35 :: [ppc64le] #200 libtalloc.git 2.3.3-alt1: build OK (cached)
2021-Oct-08 02:59:35 :: [ppc64le] #300 cmocka.git 1.1.5-alt1: build start
2021-Oct-08 02:59:43 :: [aarch64] #300 cmocka.git 1.1.5-alt1: build OK (cached)
2021-Oct-08 02:59:43 :: [aarch64] #400 libtevent.git 0.11.0-alt1: build start
2021-Oct-08 02:59:46 :: [armh] #200 libtalloc.git 2.3.3-alt1: build OK (cached)
2021-Oct-08 02:59:46 :: [armh] #300 cmocka.git 1.1.5-alt1: build start
2021-Oct-08 02:59:47 :: [i586] #300 cmocka.git 1.1.5-alt1: build OK (cached)
2021-Oct-08 02:59:47 :: [i586] #400 libtevent.git 0.11.0-alt1: build start
2021-Oct-08 02:59:49 :: [x86_64] #400 libtevent.git 0.11.0-alt1: build OK (cached)
2021-Oct-08 02:59:49 :: [x86_64] #540 libldb.git 2.4.0-alt2: build start
2021-Oct-08 02:59:53 :: [ppc64le] #300 cmocka.git 1.1.5-alt1: build OK (cached)
2021-Oct-08 02:59:53 :: [ppc64le] #400 libtevent.git 0.11.0-alt1: build start
2021-Oct-08 03:00:01 :: [aarch64] #400 libtevent.git 0.11.0-alt1: build OK (cached)
2021-Oct-08 03:00:01 :: [aarch64] #540 libldb.git 2.4.0-alt2: build start
2021-Oct-08 03:00:01 :: [i586] #400 libtevent.git 0.11.0-alt1: build OK (cached)
2021-Oct-08 03:00:01 :: [i586] #540 libldb.git 2.4.0-alt2: build start
2021-Oct-08 03:00:10 :: [armh] #300 cmocka.git 1.1.5-alt1: build OK (cached)
2021-Oct-08 03:00:10 :: [armh] #400 libtevent.git 0.11.0-alt1: build start
2021-Oct-08 03:00:12 :: [ppc64le] #400 libtevent.git 0.11.0-alt1: build OK (cached)
2021-Oct-08 03:00:12 :: [ppc64le] #540 libldb.git 2.4.0-alt2: build start
2021-Oct-08 03:00:36 :: [armh] #400 libtevent.git 0.11.0-alt1: build OK (cached)
2021-Oct-08 03:00:36 :: [armh] #540 libldb.git 2.4.0-alt2: build start
[i586] [  PASSED  ] 1 test(s).
[i586] testsuite returned 0
[i586] Running Python test with /usr/bin/python3: tests/python/api.py
[i586] Python test failed: SELFTEST_PREFIX=bin/st PYTHONPATH=bin/python /usr/bin/python3 tests/python/api.py
[i586] Running Python test with /usr/bin/python3: tests/python/crash.py
[i586] Running Python test with /usr/bin/python3: tests/python/index.py
[i586] Running Python test with /usr/bin/python3: tests/python/repack.py
[i586] Python testsuite returned 1
[i586] make: *** [Makefile:17: test] Error 1
[i586] make: Leaving directory '/usr/src/RPM/BUILD/ldb-2.4.0'
2021-Oct-08 03:02:49 :: [i586] libldb.git 2.4.0-alt2: remote: build failed
2021-Oct-08 03:02:49 :: [i586] #540 libldb.git 2.4.0-alt2: build FAILED
2021-Oct-08 03:02:49 :: [i586] requesting cancellation of task processing
2021-Oct-08 03:03:12 :: [x86_64] #540 libldb.git 2.4.0-alt2: build OK
2021-Oct-08 03:03:12 :: [x86_64] task processing CANCELLED
2021-Oct-08 03:03:59 :: [aarch64] #540 libldb.git 2.4.0-alt2: build OK
2021-Oct-08 03:03:59 :: [aarch64] task processing CANCELLED
2021-Oct-08 03:04:35 :: [ppc64le] #540 libldb.git 2.4.0-alt2: build OK
2021-Oct-08 03:04:35 :: [ppc64le] task processing CANCELLED
[armh] [  PASSED  ] 1 test(s).
[armh] testsuite returned 0
[armh] Running Python test with /usr/bin/python3: tests/python/api.py
[armh] Python test failed: SELFTEST_PREFIX=bin/st PYTHONPATH=bin/python /usr/bin/python3 tests/python/api.py
[armh] Running Python test with /usr/bin/python3: tests/python/crash.py
[armh] Running Python test with /usr/bin/python3: tests/python/index.py
[armh] Running Python test with /usr/bin/python3: tests/python/repack.py
[armh] Python testsuite returned 1
[armh] make: *** [Makefile:17: test] Error 1
[armh] make: Leaving directory '/usr/src/RPM/BUILD/ldb-2.4.0'
2021-Oct-08 03:04:40 :: [armh] libldb.git 2.4.0-alt2: remote: build failed
2021-Oct-08 03:04:40 :: [armh] #540 libldb.git 2.4.0-alt2: build FAILED
2021-Oct-08 03:02:49 :: [i586] build FAILED
2021-Oct-08 03:03:12 :: [x86_64] build FAILED
2021-Oct-08 03:03:59 :: [aarch64] build FAILED
2021-Oct-08 03:04:35 :: [ppc64le] build FAILED
2021-Oct-08 03:04:40 :: [armh] build FAILED
2021-Oct-08 03:04:40 :: task #286567 for sisyphus FAILED


More information about the Sisyphus-incominger mailing list