[#273058] [test-only] FAILED libaom.git=3.0.0-alt1

Girar awaiter (ilyakurdyukov) girar-builder at altlinux.org
Mon May 31 14:46:30 MSK 2021


http://git.altlinux.org/tasks/273058/logs/events.1.1.log

subtask  name    aarch64    armh    i586  ppc64le  x86_64
   #100  libaom   failed  failed  failed   failed  failed

2021-May-31 11:44:36 :: test-only task #273058 for sisyphus started by ilyakurdyukov:
#100 build 3.0.0-alt1 from /people/ilyakurdyukov/packages/libaom.git fetched at 2021-May-31 11:43:48
2021-May-31 11:44:37 :: [i586] #100 libaom.git 3.0.0-alt1: build start
2021-May-31 11:44:37 :: [armh] #100 libaom.git 3.0.0-alt1: build start
2021-May-31 11:44:37 :: [x86_64] #100 libaom.git 3.0.0-alt1: build start
2021-May-31 11:44:37 :: [ppc64le] #100 libaom.git 3.0.0-alt1: build start
2021-May-31 11:44:37 :: [aarch64] #100 libaom.git 3.0.0-alt1: build start
[aarch64] + cp -prL BUILD/docs/html /usr/src/tmp/libaom-buildroot/usr/share/doc/libaom-docs-3.0.0
[aarch64] cp: cannot stat 'BUILD/docs/html': No such file or directory
2021-May-31 11:45:51 :: [aarch64] libaom.git 3.0.0-alt1: remote: build failed
2021-May-31 11:45:51 :: [aarch64] #100 libaom.git 3.0.0-alt1: build FAILED
2021-May-31 11:45:51 :: [aarch64] requesting cancellation of task processing
[x86_64] + cp -prL BUILD/docs/html /usr/src/tmp/libaom-buildroot/usr/share/doc/libaom-docs-3.0.0
[x86_64] cp: cannot stat 'BUILD/docs/html': No such file or directory
2021-May-31 11:46:06 :: [x86_64] libaom.git 3.0.0-alt1: remote: build failed
2021-May-31 11:46:06 :: [x86_64] #100 libaom.git 3.0.0-alt1: build FAILED
[ppc64le] + cp -prL BUILD/docs/html /usr/src/tmp/libaom-buildroot/usr/share/doc/libaom-docs-3.0.0
[ppc64le] cp: cannot stat 'BUILD/docs/html': No such file or directory
2021-May-31 11:46:09 :: [ppc64le] libaom.git 3.0.0-alt1: remote: build failed
2021-May-31 11:46:09 :: [ppc64le] #100 libaom.git 3.0.0-alt1: build FAILED
[i586] + cp -prL BUILD/docs/html /usr/src/tmp/libaom-buildroot/usr/share/doc/libaom-docs-3.0.0
[i586] cp: cannot stat 'BUILD/docs/html': No such file or directory
2021-May-31 11:46:10 :: [i586] libaom.git 3.0.0-alt1: remote: build failed
2021-May-31 11:46:10 :: [i586] #100 libaom.git 3.0.0-alt1: build FAILED
[armh] + cp -prL BUILD/docs/html /usr/src/tmp/libaom-buildroot/usr/share/doc/libaom-docs-3.0.0
[armh] cp: cannot stat 'BUILD/docs/html': No such file or directory
2021-May-31 11:46:30 :: [armh] libaom.git 3.0.0-alt1: remote: build failed
2021-May-31 11:46:30 :: [armh] #100 libaom.git 3.0.0-alt1: build FAILED
2021-May-31 11:45:51 :: [aarch64] build FAILED
2021-May-31 11:46:06 :: [x86_64] build FAILED
2021-May-31 11:46:09 :: [ppc64le] build FAILED
2021-May-31 11:46:10 :: [i586] build FAILED
2021-May-31 11:46:30 :: [armh] build FAILED
2021-May-31 11:46:30 :: task #273058 for sisyphus FAILED


More information about the Sisyphus-incominger mailing list