[#272077] FAILED (try 3) python3-module-matplotlib.git=3.4.2-alt2

Girar awaiter (grenka) girar-builder at altlinux.org
Tue May 18 15:15:41 MSK 2021


http://git.altlinux.org/tasks/272077/logs/events.3.1.log

subtask  name                       aarch64    armh    i586  ppc64le  x86_64
   #300  python3-module-matplotlib   failed  failed  failed   failed  failed

2021-May-18 12:08:22 :: task #272077 for sisyphus resumed by grenka:
#100 removed
#200 removed
#300 build 3.4.2-alt2 from /people/grenka/packages/python3-module-matplotlib.git fetched at 2021-May-18 12:07:25
2021-May-18 12:08:23 :: [i586] #300 python3-module-matplotlib.git 3.4.2-alt2: build start
2021-May-18 12:08:23 :: [x86_64] #300 python3-module-matplotlib.git 3.4.2-alt2: build start
2021-May-18 12:08:23 :: [aarch64] #300 python3-module-matplotlib.git 3.4.2-alt2: build start
2021-May-18 12:08:23 :: [ppc64le] #300 python3-module-matplotlib.git 3.4.2-alt2: build start
2021-May-18 12:08:23 :: [armh] #300 python3-module-matplotlib.git 3.4.2-alt2: build start
[aarch64] /.out/python3-module-matplotlib-3.4.2-alt2.aarch64.rpm: invalid python3 module version file(s): /usr/lib64/python3/site-packages/matplotlib-0+unknown-py3.9.egg-info
[aarch64] sisyphus_check: check-python ERROR: python modules packaging violation
[aarch64] /.out/python3-module-matplotlib-3.4.2-alt2.aarch64.rpm: license not found in '/usr/share/license' directory: see
[aarch64] --
[aarch64] /.out/python3-module-matplotlib-tk-debuginfo-3.4.2-alt2.aarch64.rpm: license not found in '/usr/share/license' directory: LICENSE
[aarch64] hsh-rebuild: python3-module-matplotlib-3.4.2-alt2.src.rpm: sisyphus_check failed.
2021-May-18 12:13:06 :: [aarch64] python3-module-matplotlib.git 3.4.2-alt2: remote: build failed
2021-May-18 12:13:06 :: [aarch64] #300 python3-module-matplotlib.git 3.4.2-alt2: build FAILED
2021-May-18 12:13:06 :: [aarch64] requesting cancellation of task processing
[x86_64] /.out/python3-module-matplotlib-3.4.2-alt2.x86_64.rpm: invalid python3 module version file(s): /usr/lib64/python3/site-packages/matplotlib-0+unknown-py3.9.egg-info
[x86_64] sisyphus_check: check-python ERROR: python modules packaging violation
[x86_64] /.out/python3-module-matplotlib-3.4.2-alt2.x86_64.rpm: license not found in '/usr/share/license' directory: see
[x86_64] --
[x86_64] /.out/python3-module-matplotlib-tk-debuginfo-3.4.2-alt2.x86_64.rpm: license not found in '/usr/share/license' directory: LICENSE
[x86_64] hsh-rebuild: python3-module-matplotlib-3.4.2-alt2.src.rpm: sisyphus_check failed.
2021-May-18 12:13:09 :: [x86_64] python3-module-matplotlib.git 3.4.2-alt2: remote: build failed
2021-May-18 12:13:09 :: [x86_64] #300 python3-module-matplotlib.git 3.4.2-alt2: build FAILED
[i586] /.out/python3-module-matplotlib-3.4.2-alt2.i586.rpm: invalid python3 module version file(s): /usr/lib/python3/site-packages/matplotlib-0+unknown-py3.9.egg-info
[i586] sisyphus_check: check-python ERROR: python modules packaging violation
[i586] /.out/python3-module-matplotlib-3.4.2-alt2.i586.rpm: license not found in '/usr/share/license' directory: see
[i586] --
[i586] /.out/python3-module-matplotlib-tk-debuginfo-3.4.2-alt2.i586.rpm: license not found in '/usr/share/license' directory: LICENSE
[i586] hsh-rebuild: python3-module-matplotlib-3.4.2-alt2.src.rpm: sisyphus_check failed.
2021-May-18 12:13:37 :: [i586] python3-module-matplotlib.git 3.4.2-alt2: remote: build failed
2021-May-18 12:13:37 :: [i586] #300 python3-module-matplotlib.git 3.4.2-alt2: build FAILED
[ppc64le] /.out/python3-module-matplotlib-3.4.2-alt2.ppc64le.rpm: invalid python3 module version file(s): /usr/lib64/python3/site-packages/matplotlib-0+unknown-py3.9.egg-info
[ppc64le] sisyphus_check: check-python ERROR: python modules packaging violation
[ppc64le] /.out/python3-module-matplotlib-3.4.2-alt2.ppc64le.rpm: license not found in '/usr/share/license' directory: see
[ppc64le] --
[ppc64le] /.out/python3-module-matplotlib-tk-debuginfo-3.4.2-alt2.ppc64le.rpm: license not found in '/usr/share/license' directory: LICENSE
[ppc64le] hsh-rebuild: python3-module-matplotlib-3.4.2-alt2.src.rpm: sisyphus_check failed.
2021-May-18 12:15:07 :: [ppc64le] python3-module-matplotlib.git 3.4.2-alt2: remote: build failed
2021-May-18 12:15:07 :: [ppc64le] #300 python3-module-matplotlib.git 3.4.2-alt2: build FAILED
[armh] /.out/python3-module-matplotlib-3.4.2-alt2.armh.rpm: invalid python3 module version file(s): /usr/lib/python3/site-packages/matplotlib-0+unknown-py3.9.egg-info
[armh] sisyphus_check: check-python ERROR: python modules packaging violation
[armh] /.out/python3-module-matplotlib-3.4.2-alt2.armh.rpm: license not found in '/usr/share/license' directory: see
[armh] --
[armh] /.out/python3-module-matplotlib-tk-debuginfo-3.4.2-alt2.armh.rpm: license not found in '/usr/share/license' directory: LICENSE
[armh] hsh-rebuild: python3-module-matplotlib-3.4.2-alt2.src.rpm: sisyphus_check failed.
2021-May-18 12:15:41 :: [armh] python3-module-matplotlib.git 3.4.2-alt2: remote: build failed
2021-May-18 12:15:41 :: [armh] #300 python3-module-matplotlib.git 3.4.2-alt2: build FAILED
2021-May-18 12:13:07 :: [aarch64] build FAILED
2021-May-18 12:13:09 :: [x86_64] build FAILED
2021-May-18 12:13:37 :: [i586] build FAILED
2021-May-18 12:15:07 :: [ppc64le] build FAILED
2021-May-18 12:15:41 :: [armh] build FAILED
2021-May-18 12:15:41 :: task #272077 for sisyphus FAILED


More information about the Sisyphus-incominger mailing list