[#271619] [test-only] FAILED (try 4) del=vtk-data8.2 del=vtk8.2 gl2ps.git=1.4.2-alt1 ...
Girar awaiter (darktemplar)
girar-builder at altlinux.org
Thu May 13 02:25:39 MSK 2021
http://git.altlinux.org/tasks/271619/logs/events.4.1.log
subtask name aarch64 armh i586 ppc64le x86_64
#300 gl2ps 2:49 4:32 3:02 3:36 2:38
#400 vtk-data 2:27 4:16 2:46 2:41 2:18
#1100 vtk8.2 42:38 failed 43:22 48:29 35:07
2021-May-12 22:30:52 :: test-only task #271619 for sisyphus resumed by darktemplar:
2021-May-12 22:30:52 :: message: upgrade_vtk_to_9.0.1
#100 delete vtk-data8.2
#200 delete vtk8.2
#300 build 1.4.2-alt1 from /people/darktemplar/packages/gl2ps.git fetched at 2021-May-12 11:14:48
#400 build vtk-data-9.0.1-alt1.src.rpm
#500 removed
#600 removed
#700 removed
#1000 removed
#1100 build 9.0.1-alt1 from /people/darktemplar/packages/vtk8.2.git fetched at 2021-May-12 15:16:15
2021-May-12 22:30:53 :: created build repo
2021-May-12 22:30:53 :: [ppc64le] #300 gl2ps.git 1.4.2-alt1: build start
2021-May-12 22:30:53 :: [armh] #300 gl2ps.git 1.4.2-alt1: build start
2021-May-12 22:30:53 :: [i586] #300 gl2ps.git 1.4.2-alt1: build start
2021-May-12 22:30:53 :: [x86_64] #300 gl2ps.git 1.4.2-alt1: build start
2021-May-12 22:30:53 :: [aarch64] #300 gl2ps.git 1.4.2-alt1: build start
2021-May-12 22:33:31 :: [x86_64] #300 gl2ps.git 1.4.2-alt1: build OK
2021-May-12 22:33:32 :: [x86_64] #400 vtk-data-9.0.1-alt1.src.rpm: build start
2021-May-12 22:33:42 :: [aarch64] #300 gl2ps.git 1.4.2-alt1: build OK
2021-May-12 22:33:42 :: [aarch64] #400 vtk-data-9.0.1-alt1.src.rpm: build start
2021-May-12 22:33:55 :: [i586] #300 gl2ps.git 1.4.2-alt1: build OK
2021-May-12 22:33:55 :: [i586] #400 vtk-data-9.0.1-alt1.src.rpm: build start
2021-May-12 22:34:29 :: [ppc64le] #300 gl2ps.git 1.4.2-alt1: build OK
2021-May-12 22:34:29 :: [ppc64le] #400 vtk-data-9.0.1-alt1.src.rpm: build start
2021-May-12 22:35:25 :: [armh] #300 gl2ps.git 1.4.2-alt1: build OK
2021-May-12 22:35:25 :: [armh] #400 vtk-data-9.0.1-alt1.src.rpm: build start
2021-May-12 22:35:50 :: [x86_64] #400 vtk-data-9.0.1-alt1.src.rpm: build OK
2021-May-12 22:35:50 :: [x86_64] #1100 vtk8.2.git 9.0.1-alt1: build start
2021-May-12 22:36:09 :: [aarch64] #400 vtk-data-9.0.1-alt1.src.rpm: build OK
2021-May-12 22:36:09 :: [aarch64] #1100 vtk8.2.git 9.0.1-alt1: build start
2021-May-12 22:36:41 :: [i586] #400 vtk-data-9.0.1-alt1.src.rpm: build OK
2021-May-12 22:36:41 :: [i586] #1100 vtk8.2.git 9.0.1-alt1: build start
2021-May-12 22:37:10 :: [ppc64le] #400 vtk-data-9.0.1-alt1.src.rpm: build OK
2021-May-12 22:37:10 :: [ppc64le] #1100 vtk8.2.git 9.0.1-alt1: build start
2021-May-12 22:39:41 :: [armh] #400 vtk-data-9.0.1-alt1.src.rpm: build OK
2021-May-12 22:39:41 :: [armh] #1100 vtk8.2.git 9.0.1-alt1: build start
[armh] /usr/src/RPM/BUILD/vtk-9.0.1/Infovis/Core/vtkWordCloud.cxx:305:17: note: parameter passing for argument of type '__gnu_cxx::__normal_iterator<double*, std::vector<double> >' changed in GCC 7.1
[armh] 305 | std::shuffle(std::begin(orientations), std::end(orientations), mt);
[armh] make[2]: Leaving directory '/usr/src/RPM/BUILD/vtk-9.0.1/BUILD'
[armh] make[2]: Entering directory '/usr/src/RPM/BUILD/vtk-9.0.1/BUILD'
[armh] [ 75%] Linking CXX shared library ../../lib/libvtkInfovisCore-9.0.so
[armh] make[2]: Leaving directory '/usr/src/RPM/BUILD/vtk-9.0.1/BUILD'
[armh] make[1]: Entering directory '/usr/src/RPM/BUILD/vtk-9.0.1/BUILD'
[armh] [ 75%] Built target InfovisCore
[armh] make[1]: Leaving directory '/usr/src/RPM/BUILD/vtk-9.0.1/BUILD'
[armh] make: *** [Makefile:160: all] Error 2
2021-May-12 22:56:08 :: [armh] vtk8.2.git 9.0.1-alt1: remote: build failed
2021-May-12 22:56:08 :: [armh] #1100 vtk8.2.git 9.0.1-alt1: build FAILED
2021-May-12 22:56:08 :: [armh] requesting cancellation of task processing
2021-May-12 23:10:57 :: [x86_64] #1100 vtk8.2.git 9.0.1-alt1: build OK
2021-May-12 23:18:47 :: [aarch64] #1100 vtk8.2.git 9.0.1-alt1: build OK
2021-May-12 23:20:03 :: [i586] #1100 vtk8.2.git 9.0.1-alt1: build OK
2021-May-12 23:25:39 :: [ppc64le] #1100 vtk8.2.git 9.0.1-alt1: build OK
2021-May-12 22:56:08 :: [armh] build FAILED
2021-May-12 23:25:39 :: task #271619 for sisyphus FAILED
More information about the Sisyphus-incominger
mailing list