[#266163] [test-only] FAILED (try 4) castxml.git=0.4.2-alt1
Girar awaiter (darktemplar)
girar-builder at altlinux.org
Mon Mar 1 17:54:37 MSK 2021
http://git.altlinux.org/tasks/266163/logs/events.4.1.log
subtask name aarch64 armh i586 ppc64le x86_64
#100 castxml failed failed failed failed failed
2021-Mar-01 14:52:09 :: test-only task #266163 for sisyphus resumed by darktemplar:
2021-Mar-01 14:52:09 :: message: test_rebuild_for_used_llvm_version_check
#100 build 0.4.2-alt1 from /gears/c/castxml.git fetched at 2021-Feb-11 07:22:49
2021-Mar-01 14:52:10 :: [x86_64] #100 castxml.git 0.4.2-alt1: build start
2021-Mar-01 14:52:10 :: [armh] #100 castxml.git 0.4.2-alt1: build start
2021-Mar-01 14:52:10 :: [i586] #100 castxml.git 0.4.2-alt1: build start
2021-Mar-01 14:52:10 :: [ppc64le] #100 castxml.git 0.4.2-alt1: build start
2021-Mar-01 14:52:10 :: [aarch64] #100 castxml.git 0.4.2-alt1: build start
[aarch64] * The file was deleted, renamed, or moved to another location.
[aarch64] * An install or uninstall procedure did not complete successfully.
[aarch64] * The installation package was faulty and contained
[aarch64] "/usr/lib/llvm-11.0/lib64/cmake/clang/ClangTargets.cmake"
[aarch64] but not all the files it references.
[aarch64] Call Stack (most recent call first):
[aarch64] /usr/lib/llvm-11.0/lib64/cmake/clang/ClangConfig.cmake:20 (include)
[aarch64] CMakeLists.txt:75 (find_package)
[aarch64] -- Configuring incomplete, errors occurred!
[aarch64] See also "/usr/src/RPM/BUILD/castxml-0.4.2/BUILD/CMakeFiles/CMakeOutput.log".
2021-Mar-01 14:54:00 :: [aarch64] castxml.git 0.4.2-alt1: remote: build failed
2021-Mar-01 14:54:00 :: [aarch64] #100 castxml.git 0.4.2-alt1: build FAILED
2021-Mar-01 14:54:00 :: [aarch64] requesting cancellation of task processing
[x86_64] * The file was deleted, renamed, or moved to another location.
[x86_64] * An install or uninstall procedure did not complete successfully.
[x86_64] * The installation package was faulty and contained
[x86_64] "/usr/lib/llvm-11.0/lib64/cmake/clang/ClangTargets.cmake"
[x86_64] but not all the files it references.
[x86_64] Call Stack (most recent call first):
[x86_64] /usr/lib/llvm-11.0/lib64/cmake/clang/ClangConfig.cmake:20 (include)
[x86_64] CMakeLists.txt:75 (find_package)
[x86_64] -- Configuring incomplete, errors occurred!
[x86_64] See also "/usr/src/RPM/BUILD/castxml-0.4.2/BUILD/CMakeFiles/CMakeOutput.log".
2021-Mar-01 14:54:01 :: [x86_64] castxml.git 0.4.2-alt1: remote: build failed
2021-Mar-01 14:54:01 :: [x86_64] #100 castxml.git 0.4.2-alt1: build FAILED
[ppc64le] * The file was deleted, renamed, or moved to another location.
[ppc64le] * An install or uninstall procedure did not complete successfully.
[ppc64le] * The installation package was faulty and contained
[ppc64le] "/usr/lib/llvm-11.0/lib64/cmake/clang/ClangTargets.cmake"
[ppc64le] but not all the files it references.
[ppc64le] Call Stack (most recent call first):
[ppc64le] /usr/lib/llvm-11.0/lib64/cmake/clang/ClangConfig.cmake:20 (include)
[ppc64le] CMakeLists.txt:75 (find_package)
[ppc64le] -- Configuring incomplete, errors occurred!
[ppc64le] See also "/usr/src/RPM/BUILD/castxml-0.4.2/BUILD/CMakeFiles/CMakeOutput.log".
2021-Mar-01 14:54:16 :: [ppc64le] castxml.git 0.4.2-alt1: remote: build failed
2021-Mar-01 14:54:16 :: [ppc64le] #100 castxml.git 0.4.2-alt1: build FAILED
[i586] * The file was deleted, renamed, or moved to another location.
[i586] * An install or uninstall procedure did not complete successfully.
[i586] * The installation package was faulty and contained
[i586] "/usr/lib/llvm-11.0/lib/cmake/clang/ClangTargets.cmake"
[i586] but not all the files it references.
[i586] Call Stack (most recent call first):
[i586] /usr/lib/llvm-11.0/lib/cmake/clang/ClangConfig.cmake:20 (include)
[i586] CMakeLists.txt:75 (find_package)
[i586] -- Configuring incomplete, errors occurred!
[i586] See also "/usr/src/RPM/BUILD/castxml-0.4.2/BUILD/CMakeFiles/CMakeOutput.log".
2021-Mar-01 14:54:25 :: [i586] castxml.git 0.4.2-alt1: remote: build failed
2021-Mar-01 14:54:25 :: [i586] #100 castxml.git 0.4.2-alt1: build FAILED
[armh] * The file was deleted, renamed, or moved to another location.
[armh] * An install or uninstall procedure did not complete successfully.
[armh] * The installation package was faulty and contained
[armh] "/usr/lib/llvm-11.0/lib/cmake/clang/ClangTargets.cmake"
[armh] but not all the files it references.
[armh] Call Stack (most recent call first):
[armh] /usr/lib/llvm-11.0/lib/cmake/clang/ClangConfig.cmake:20 (include)
[armh] CMakeLists.txt:75 (find_package)
[armh] -- Configuring incomplete, errors occurred!
[armh] See also "/usr/src/RPM/BUILD/castxml-0.4.2/BUILD/CMakeFiles/CMakeOutput.log".
2021-Mar-01 14:54:37 :: [armh] castxml.git 0.4.2-alt1: remote: build failed
2021-Mar-01 14:54:37 :: [armh] #100 castxml.git 0.4.2-alt1: build FAILED
2021-Mar-01 14:54:00 :: [aarch64] build FAILED
2021-Mar-01 14:54:01 :: [x86_64] build FAILED
2021-Mar-01 14:54:16 :: [ppc64le] build FAILED
2021-Mar-01 14:54:25 :: [i586] build FAILED
2021-Mar-01 14:54:37 :: [armh] build FAILED
2021-Mar-01 14:54:37 :: task #266163 for sisyphus FAILED
More information about the Sisyphus-incominger
mailing list