[#274565] [test-only] FAILED system-config-printer.git=v1.5.11-alt9

Girar awaiter (manowar) girar-builder at altlinux.org
Tue Jun 15 11:57:59 MSK 2021


http://git.altlinux.org/tasks/274565/logs/events.1.1.log

subtask  name                   aarch64    armh    i586  ppc64le  x86_64
   #100  system-config-printer   failed  failed  failed   failed  failed

2021-Jun-15 08:56:56 :: test-only task #274565 for sisyphus started by manowar:
#100 build v1.5.11-alt9 from /people/manowar/packages/system-config-printer.git fetched at 2021-Jun-15 08:56:38
2021-Jun-15 08:56:57 :: [i586] #100 system-config-printer.git v1.5.11-alt9: build start
2021-Jun-15 08:56:57 :: [aarch64] #100 system-config-printer.git v1.5.11-alt9: build start
2021-Jun-15 08:56:57 :: [x86_64] #100 system-config-printer.git v1.5.11-alt9: build start
2021-Jun-15 08:56:57 :: [ppc64le] #100 system-config-printer.git v1.5.11-alt9: build start
2021-Jun-15 08:56:57 :: [armh] #100 system-config-printer.git v1.5.11-alt9: build start
[i586] find-provides: running scripts (alternatives,debuginfo,gir,lib,pam,perl,pkgconfig,python,python3,shell,typelib)
[i586] /usr/lib/rpm/python.prov: ERROR: /usr/lib/rpm/python.prov.py is not available, the following files cannot be processed: /usr/src/tmp/system-config-printer-buildroot/usr/share/system-config-printer/markjob.py 
[i586] find-provides: ERROR: /usr/lib/rpm/python.prov failed
[i586] error: /bin/sh failed
[i586] error: Failed to find Provides
[i586] RPM build errors:
2021-Jun-15 08:57:36 :: [i586] system-config-printer.git v1.5.11-alt9: remote: build failed
2021-Jun-15 08:57:36 :: [i586] #100 system-config-printer.git v1.5.11-alt9: build FAILED
2021-Jun-15 08:57:36 :: [i586] requesting cancellation of task processing
[aarch64] find-provides: running scripts (alternatives,debuginfo,gir,lib,pam,perl,pkgconfig,python,python3,shell,typelib)
[aarch64] /usr/lib/rpm/python.prov: ERROR: /usr/lib/rpm/python.prov.py is not available, the following files cannot be processed: /usr/src/tmp/system-config-printer-buildroot/usr/share/system-config-printer/markjob.py 
[aarch64] find-provides: ERROR: /usr/lib/rpm/python.prov failed
[aarch64] error: /bin/sh failed
[aarch64] error: Failed to find Provides
[aarch64] RPM build errors:
2021-Jun-15 08:57:38 :: [aarch64] system-config-printer.git v1.5.11-alt9: remote: build failed
2021-Jun-15 08:57:38 :: [aarch64] #100 system-config-printer.git v1.5.11-alt9: build FAILED
[x86_64] find-provides: running scripts (alternatives,debuginfo,gir,lib,pam,perl,pkgconfig,python,python3,shell,typelib)
[x86_64] /usr/lib/rpm/python.prov: ERROR: /usr/lib/rpm/python.prov.py is not available, the following files cannot be processed: /usr/src/tmp/system-config-printer-buildroot/usr/share/system-config-printer/markjob.py 
[x86_64] find-provides: ERROR: /usr/lib/rpm/python.prov failed
[x86_64] error: /bin/sh failed
[x86_64] error: Failed to find Provides
[x86_64] RPM build errors:
2021-Jun-15 08:57:41 :: [x86_64] system-config-printer.git v1.5.11-alt9: remote: build failed
2021-Jun-15 08:57:41 :: [x86_64] #100 system-config-printer.git v1.5.11-alt9: build FAILED
[ppc64le] find-provides: running scripts (alternatives,debuginfo,gir,lib,pam,perl,pkgconfig,python,python3,shell,typelib)
[ppc64le] /usr/lib/rpm/python.prov: ERROR: /usr/lib/rpm/python.prov.py is not available, the following files cannot be processed: /usr/src/tmp/system-config-printer-buildroot/usr/share/system-config-printer/markjob.py 
[ppc64le] find-provides: ERROR: /usr/lib/rpm/python.prov failed
[ppc64le] error: /bin/sh failed
[ppc64le] error: Failed to find Provides
[ppc64le] RPM build errors:
2021-Jun-15 08:57:50 :: [ppc64le] system-config-printer.git v1.5.11-alt9: remote: build failed
2021-Jun-15 08:57:50 :: [ppc64le] #100 system-config-printer.git v1.5.11-alt9: build FAILED
[armh] find-provides: running scripts (alternatives,debuginfo,gir,lib,pam,perl,pkgconfig,python,python3,shell,typelib)
[armh] /usr/lib/rpm/python.prov: ERROR: /usr/lib/rpm/python.prov.py is not available, the following files cannot be processed: /usr/src/tmp/system-config-printer-buildroot/usr/share/system-config-printer/markjob.py 
[armh] find-provides: ERROR: /usr/lib/rpm/python.prov failed
[armh] error: /bin/sh failed
[armh] error: Failed to find Provides
[armh] RPM build errors:
2021-Jun-15 08:57:59 :: [armh] system-config-printer.git v1.5.11-alt9: remote: build failed
2021-Jun-15 08:57:59 :: [armh] #100 system-config-printer.git v1.5.11-alt9: build FAILED
2021-Jun-15 08:57:36 :: [i586] build FAILED
2021-Jun-15 08:57:38 :: [aarch64] build FAILED
2021-Jun-15 08:57:41 :: [x86_64] build FAILED
2021-Jun-15 08:57:50 :: [ppc64le] build FAILED
2021-Jun-15 08:57:59 :: [armh] build FAILED
2021-Jun-15 08:57:59 :: task #274565 for sisyphus FAILED


More information about the Sisyphus-incominger mailing list