[#273758] FAILED srpm=opticalraytracer-2.7-alt3_12jpp11.src.rpm
Girar awaiter (viy)
girar-builder at altlinux.org
Sun Jun 6 23:27:59 MSK 2021
http://git.altlinux.org/tasks/273758/logs/events.1.1.log
subtask name aarch64 armh i586 ppc64le x86_64
#100 opticalraytracer failed failed failed failed failed
2021-Jun-06 20:26:56 :: task #273758 for sisyphus started by viy:
#100 build opticalraytracer-2.7-alt3_12jpp11.src.rpm
2021-Jun-06 20:26:57 :: [x86_64] #100 opticalraytracer-2.7-alt3_12jpp11.src.rpm: build start
2021-Jun-06 20:26:57 :: [aarch64] #100 opticalraytracer-2.7-alt3_12jpp11.src.rpm: build start
2021-Jun-06 20:26:57 :: [ppc64le] #100 opticalraytracer-2.7-alt3_12jpp11.src.rpm: build start
2021-Jun-06 20:26:57 :: [armh] #100 opticalraytracer-2.7-alt3_12jpp11.src.rpm: build start
2021-Jun-06 20:26:57 :: [i586] #100 opticalraytracer-2.7-alt3_12jpp11.src.rpm: build start
[x86_64] [javac] warning: [options] bootstrap class path not set in conjunction with -source 5
[x86_64] [javac] error: Source option 5 is no longer supported. Use 6 or later.
[x86_64] [javac] error: Target option 1.5 is no longer supported. Use 1.6 or later.
[x86_64] BUILD FAILED
[x86_64] /usr/src/RPM/BUILD/opticalraytracer-2.7/nbproject/build-impl.xml:363: The following error occurred while executing this line:
2021-Jun-06 20:27:34 :: [x86_64] opticalraytracer-2.7-alt3_12jpp11.src.rpm: remote: build failed
2021-Jun-06 20:27:34 :: [x86_64] #100 opticalraytracer-2.7-alt3_12jpp11.src.rpm: build FAILED
2021-Jun-06 20:27:34 :: [x86_64] requesting cancellation of task processing
[aarch64] [javac] warning: [options] bootstrap class path not set in conjunction with -source 5
[aarch64] [javac] error: Source option 5 is no longer supported. Use 6 or later.
[aarch64] [javac] error: Target option 1.5 is no longer supported. Use 1.6 or later.
[aarch64] BUILD FAILED
[aarch64] /usr/src/RPM/BUILD/opticalraytracer-2.7/nbproject/build-impl.xml:363: The following error occurred while executing this line:
2021-Jun-06 20:27:36 :: [aarch64] opticalraytracer-2.7-alt3_12jpp11.src.rpm: remote: build failed
2021-Jun-06 20:27:36 :: [aarch64] #100 opticalraytracer-2.7-alt3_12jpp11.src.rpm: build FAILED
[i586] [javac] warning: [options] bootstrap class path not set in conjunction with -source 5
[i586] [javac] error: Source option 5 is no longer supported. Use 6 or later.
[i586] [javac] error: Target option 1.5 is no longer supported. Use 1.6 or later.
[i586] BUILD FAILED
[i586] /usr/src/RPM/BUILD/opticalraytracer-2.7/nbproject/build-impl.xml:363: The following error occurred while executing this line:
2021-Jun-06 20:27:38 :: [i586] opticalraytracer-2.7-alt3_12jpp11.src.rpm: remote: build failed
2021-Jun-06 20:27:38 :: [i586] #100 opticalraytracer-2.7-alt3_12jpp11.src.rpm: build FAILED
[ppc64le] [javac] warning: [options] bootstrap class path not set in conjunction with -source 5
[ppc64le] [javac] error: Source option 5 is no longer supported. Use 6 or later.
[ppc64le] [javac] error: Target option 1.5 is no longer supported. Use 1.6 or later.
[ppc64le] BUILD FAILED
[ppc64le] /usr/src/RPM/BUILD/opticalraytracer-2.7/nbproject/build-impl.xml:363: The following error occurred while executing this line:
2021-Jun-06 20:27:43 :: [ppc64le] opticalraytracer-2.7-alt3_12jpp11.src.rpm: remote: build failed
2021-Jun-06 20:27:43 :: [ppc64le] #100 opticalraytracer-2.7-alt3_12jpp11.src.rpm: build FAILED
[armh] [javac] warning: [options] bootstrap class path not set in conjunction with -source 5
[armh] [javac] error: Source option 5 is no longer supported. Use 6 or later.
[armh] [javac] error: Target option 1.5 is no longer supported. Use 1.6 or later.
[armh] BUILD FAILED
[armh] /usr/src/RPM/BUILD/opticalraytracer-2.7/nbproject/build-impl.xml:363: The following error occurred while executing this line:
2021-Jun-06 20:27:59 :: [armh] opticalraytracer-2.7-alt3_12jpp11.src.rpm: remote: build failed
2021-Jun-06 20:27:59 :: [armh] #100 opticalraytracer-2.7-alt3_12jpp11.src.rpm: build FAILED
2021-Jun-06 20:27:34 :: [x86_64] build FAILED
2021-Jun-06 20:27:36 :: [aarch64] build FAILED
2021-Jun-06 20:27:38 :: [i586] build FAILED
2021-Jun-06 20:27:43 :: [ppc64le] build FAILED
2021-Jun-06 20:27:59 :: [armh] build FAILED
2021-Jun-06 20:27:59 :: task #273758 for sisyphus FAILED
More information about the Sisyphus-incominger
mailing list