[#266727] p9 FAILED (try 5) geary.git=3.34.2-alt1
Girar awaiter (lvol)
girar-builder at altlinux.org
Wed Feb 24 15:54:56 MSK 2021
http://git.altlinux.org/tasks/266727/logs/events.5.1.log
subtask name aarch64 armh i586 ppc64le x86_64
#300 geary 2:19 3:19 2:16 2:55 2:02
2021-Feb-24 12:51:31 :: task #266727 for p9 resumed by lvol:
2021-Feb-24 12:51:31 :: message: bug_39680
#100 removed
#140 removed
#200 removed
#300 build 3.34.2-alt1 from /people/lvol/packages/geary.git fetched at 2021-Feb-24 12:50:25
2021-Feb-24 12:51:32 :: [armh] #300 geary.git 3.34.2-alt1: build start
2021-Feb-24 12:51:32 :: [i586] #300 geary.git 3.34.2-alt1: build start
2021-Feb-24 12:51:32 :: [x86_64] #300 geary.git 3.34.2-alt1: build start
2021-Feb-24 12:51:32 :: [ppc64le] #300 geary.git 3.34.2-alt1: build start
2021-Feb-24 12:51:32 :: [aarch64] #300 geary.git 3.34.2-alt1: build start
2021-Feb-24 12:53:34 :: [x86_64] #300 geary.git 3.34.2-alt1: build OK
2021-Feb-24 12:53:48 :: [i586] #300 geary.git 3.34.2-alt1: build OK
2021-Feb-24 12:53:51 :: [aarch64] #300 geary.git 3.34.2-alt1: build OK
2021-Feb-24 12:54:27 :: [ppc64le] #300 geary.git 3.34.2-alt1: build OK
2021-Feb-24 12:54:51 :: [armh] #300 geary.git 3.34.2-alt1: build OK
geary-3.34.2-alt1.x86_64.rpm: changelog name (aris@) does not match expected name (lvol@)
geary-debuginfo-3.34.2-alt1.x86_64.rpm: changelog name (aris@) does not match expected name (lvol@)
geary-3.34.2-alt1.src.rpm: changelog name (aris@) does not match expected name (lvol@)
2021-Feb-24 12:54:55 :: #300: geary.git 3.34.2-alt1: changelog name check FAILED
2021-Feb-24 12:54:55 :: build check FAILED for #300
2021-Feb-24 12:54:56 :: build check FAILED
2021-Feb-24 12:54:56 :: task #266727 for p9 FAILED
More information about the Sisyphus-incominger
mailing list