[#266494] [test-only] FAILED visualboyadvance-m.git=2.1.4-alt1

Girar awaiter (oddity) girar-builder at altlinux.org
Wed Feb 17 13:10:43 MSK 2021


http://git.altlinux.org/tasks/266494/logs/events.1.1.log

subtask  name                aarch64    armh    i586  ppc64le  x86_64
   #100  visualboyadvance-m   failed  failed  failed   failed  failed

2021-Feb-17 10:07:59 :: test-only task #266494 for sisyphus started by oddity:
#100 build 2.1.4-alt1 from /people/oddity/packages/visualboyadvance-m.git fetched at 2021-Feb-17 10:07:57
2021-Feb-17 10:08:00 :: [x86_64] #100 visualboyadvance-m.git 2.1.4-alt1: build start
2021-Feb-17 10:08:00 :: [i586] #100 visualboyadvance-m.git 2.1.4-alt1: build start
2021-Feb-17 10:08:00 :: [aarch64] #100 visualboyadvance-m.git 2.1.4-alt1: build start
2021-Feb-17 10:08:00 :: [ppc64le] #100 visualboyadvance-m.git 2.1.4-alt1: build start
2021-Feb-17 10:08:00 :: [armh] #100 visualboyadvance-m.git 2.1.4-alt1: build start
[x86_64] -- Looking for __WXGTK4__ - not found
[x86_64] -- Looking for __WXGTK3__
[x86_64] -- Looking for __WXGTK3__ - not found
[x86_64] -- Looking for __WXGTK20__
[x86_64] -- Looking for __WXGTK20__ - not found
[x86_64] CMake Error at src/wx/CMakeLists.txt:449 (message):
[x86_64]   Could not find gtk
[x86_64] -- Configuring incomplete, errors occurred!
[x86_64] See also "/usr/src/RPM/BUILD/visualboyadvance-m-2.1.4/BUILD/CMakeFiles/CMakeOutput.log".
[x86_64] See also "/usr/src/RPM/BUILD/visualboyadvance-m-2.1.4/BUILD/CMakeFiles/CMakeError.log".
2021-Feb-17 10:09:43 :: [x86_64] visualboyadvance-m.git 2.1.4-alt1: remote: build failed
2021-Feb-17 10:09:43 :: [x86_64] #100 visualboyadvance-m.git 2.1.4-alt1: build FAILED
2021-Feb-17 10:09:43 :: [x86_64] requesting cancellation of task processing
[i586] -- Looking for __WXGTK4__ - not found
[i586] -- Looking for __WXGTK3__
[i586] -- Looking for __WXGTK3__ - not found
[i586] -- Looking for __WXGTK20__
[i586] -- Looking for __WXGTK20__ - not found
[i586] CMake Error at src/wx/CMakeLists.txt:449 (message):
[i586]   Could not find gtk
[i586] -- Configuring incomplete, errors occurred!
[i586] See also "/usr/src/RPM/BUILD/visualboyadvance-m-2.1.4/BUILD/CMakeFiles/CMakeOutput.log".
[i586] See also "/usr/src/RPM/BUILD/visualboyadvance-m-2.1.4/BUILD/CMakeFiles/CMakeError.log".
2021-Feb-17 10:09:48 :: [i586] visualboyadvance-m.git 2.1.4-alt1: remote: build failed
2021-Feb-17 10:09:48 :: [i586] #100 visualboyadvance-m.git 2.1.4-alt1: build FAILED
[aarch64] -- Looking for __WXGTK4__ - not found
[aarch64] -- Looking for __WXGTK3__
[aarch64] -- Looking for __WXGTK3__ - not found
[aarch64] -- Looking for __WXGTK20__
[aarch64] -- Looking for __WXGTK20__ - not found
[aarch64] CMake Error at src/wx/CMakeLists.txt:449 (message):
[aarch64]   Could not find gtk
[aarch64] -- Configuring incomplete, errors occurred!
[aarch64] See also "/usr/src/RPM/BUILD/visualboyadvance-m-2.1.4/BUILD/CMakeFiles/CMakeOutput.log".
[aarch64] See also "/usr/src/RPM/BUILD/visualboyadvance-m-2.1.4/BUILD/CMakeFiles/CMakeError.log".
2021-Feb-17 10:09:59 :: [aarch64] visualboyadvance-m.git 2.1.4-alt1: remote: build failed
2021-Feb-17 10:09:59 :: [aarch64] #100 visualboyadvance-m.git 2.1.4-alt1: build FAILED
[ppc64le] -- Looking for __WXGTK4__ - not found
[ppc64le] -- Looking for __WXGTK3__
[ppc64le] -- Looking for __WXGTK3__ - not found
[ppc64le] -- Looking for __WXGTK20__
[ppc64le] -- Looking for __WXGTK20__ - not found
[ppc64le] CMake Error at src/wx/CMakeLists.txt:449 (message):
[ppc64le]   Could not find gtk
[ppc64le] -- Configuring incomplete, errors occurred!
[ppc64le] See also "/usr/src/RPM/BUILD/visualboyadvance-m-2.1.4/BUILD/CMakeFiles/CMakeOutput.log".
[ppc64le] See also "/usr/src/RPM/BUILD/visualboyadvance-m-2.1.4/BUILD/CMakeFiles/CMakeError.log".
2021-Feb-17 10:10:11 :: [ppc64le] visualboyadvance-m.git 2.1.4-alt1: remote: build failed
2021-Feb-17 10:10:11 :: [ppc64le] #100 visualboyadvance-m.git 2.1.4-alt1: build FAILED
[armh] -- Looking for __WXGTK4__ - not found
[armh] -- Looking for __WXGTK3__
[armh] -- Looking for __WXGTK3__ - not found
[armh] -- Looking for __WXGTK20__
[armh] -- Looking for __WXGTK20__ - not found
[armh] CMake Error at src/wx/CMakeLists.txt:449 (message):
[armh]   Could not find gtk
[armh] -- Configuring incomplete, errors occurred!
[armh] See also "/usr/src/RPM/BUILD/visualboyadvance-m-2.1.4/BUILD/CMakeFiles/CMakeOutput.log".
[armh] See also "/usr/src/RPM/BUILD/visualboyadvance-m-2.1.4/BUILD/CMakeFiles/CMakeError.log".
2021-Feb-17 10:10:43 :: [armh] visualboyadvance-m.git 2.1.4-alt1: remote: build failed
2021-Feb-17 10:10:43 :: [armh] #100 visualboyadvance-m.git 2.1.4-alt1: build FAILED
2021-Feb-17 10:09:43 :: [x86_64] build FAILED
2021-Feb-17 10:09:48 :: [i586] build FAILED
2021-Feb-17 10:10:00 :: [aarch64] build FAILED
2021-Feb-17 10:10:11 :: [ppc64le] build FAILED
2021-Feb-17 10:10:43 :: [armh] build FAILED
2021-Feb-17 10:10:43 :: task #266494 for sisyphus FAILED


More information about the Sisyphus-incominger mailing list