[#292329] FAILED crash.git=8.0.0-alt1
Girar awaiter (vt)
girar-builder at altlinux.org
Mon Dec 20 08:21:13 MSK 2021
https://git.altlinux.org/tasks/292329/logs/events.1.1.log
subtask name aarch64 armh i586 ppc64le x86_64
#100 crash 18:22 failed failed 20:51 9:07
2021-Dec-20 04:57:20 :: task #292329 for sisyphus started by vt:
#100 build 8.0.0-alt1 from /people/vt/packages/crash.git fetched at 2021-Dec-20 04:57:18
2021-Dec-20 04:57:20 :: [aarch64] #100 crash.git 8.0.0-alt1: build start
2021-Dec-20 04:57:20 :: [ppc64le] #100 crash.git 8.0.0-alt1: build start
2021-Dec-20 04:57:20 :: [i586] #100 crash.git 8.0.0-alt1: build start
2021-Dec-20 04:57:20 :: [armh] #100 crash.git 8.0.0-alt1: build start
2021-Dec-20 04:57:20 :: [x86_64] #100 crash.git 8.0.0-alt1: build start
2021-Dec-20 05:06:27 :: [x86_64] #100 crash.git 8.0.0-alt1: build OK
[i586] verify-elf: WARNING: ./usr/lib/crash/extensions/cacheutils.so: undefined symbol: get_pathname
[i586] verify-elf: ERROR: ./usr/bin/crash: uses non-LFS functions: lseek open
2021-Dec-20 05:06:46 :: [i586] crash.git 8.0.0-alt1: remote: build failed
2021-Dec-20 05:06:46 :: [i586] #100 crash.git 8.0.0-alt1: build FAILED
2021-Dec-20 05:06:46 :: [i586] requesting cancellation of task processing
2021-Dec-20 05:15:42 :: [aarch64] #100 crash.git 8.0.0-alt1: build OK
2021-Dec-20 05:18:11 :: [ppc64le] #100 crash.git 8.0.0-alt1: build OK
[armh] verify-elf: WARNING: ./usr/bin/crash: skipping eu-elflint by request
[armh] verify-elf: ERROR: ./usr/bin/crash: uses non-LFS functions: lseek open
2021-Dec-20 05:21:12 :: [armh] crash.git 8.0.0-alt1: remote: build failed
2021-Dec-20 05:21:12 :: [armh] #100 crash.git 8.0.0-alt1: build FAILED
2021-Dec-20 05:06:46 :: [i586] build FAILED
2021-Dec-20 05:21:12 :: [armh] build FAILED
2021-Dec-20 05:21:12 :: task #292329 for sisyphus FAILED
More information about the Sisyphus-incominger
mailing list