[#248652] FAILED python3-module-kiwisolver.git=1.2.0-alt1

Girar Builder awaiter robot girar-builder at altlinux.org
Fri Mar 27 11:45:16 MSK 2020


http://git.altlinux.org/tasks/248652/logs/events.1.1.log

2020-Mar-27 08:44:39 :: task #248652 for sisyphus started by cas:
#100 build 1.2.0-alt1 from /people/cas/packages/python3-module-kiwisolver.git fetched at 2020-Mar-27 08:44:38
2020-Mar-27 08:44:40 :: [x86_64] #100 python3-module-kiwisolver.git 1.2.0-alt1: build start
2020-Mar-27 08:44:40 :: [i586] #100 python3-module-kiwisolver.git 1.2.0-alt1: build start
2020-Mar-27 08:44:40 :: [aarch64] #100 python3-module-kiwisolver.git 1.2.0-alt1: build start
2020-Mar-27 08:44:40 :: [ppc64le] #100 python3-module-kiwisolver.git 1.2.0-alt1: build start
    raise DistutilsError(msg)
distutils.errors.DistutilsError: Could not find suitable distribution for Requirement.parse('cppy>=1.1.0')
2020-Mar-27 08:45:11 :: [aarch64] python3-module-kiwisolver.git 1.2.0-alt1: remote: build failed
2020-Mar-27 08:45:11 :: [aarch64] #100 python3-module-kiwisolver.git 1.2.0-alt1: build FAILED
2020-Mar-27 08:45:11 :: [aarch64] requesting cancellation of task processing
    raise DistutilsError(msg)
distutils.errors.DistutilsError: Could not find suitable distribution for Requirement.parse('cppy>=1.1.0')
2020-Mar-27 08:45:11 :: [ppc64le] python3-module-kiwisolver.git 1.2.0-alt1: remote: build failed
2020-Mar-27 08:45:11 :: [ppc64le] #100 python3-module-kiwisolver.git 1.2.0-alt1: build FAILED
    raise DistutilsError(msg)
distutils.errors.DistutilsError: Could not find suitable distribution for Requirement.parse('cppy>=1.1.0')
2020-Mar-27 08:45:13 :: [x86_64] python3-module-kiwisolver.git 1.2.0-alt1: remote: build failed
2020-Mar-27 08:45:13 :: [x86_64] #100 python3-module-kiwisolver.git 1.2.0-alt1: build FAILED
    raise DistutilsError(msg)
distutils.errors.DistutilsError: Could not find suitable distribution for Requirement.parse('cppy>=1.1.0')
2020-Mar-27 08:45:15 :: [i586] python3-module-kiwisolver.git 1.2.0-alt1: remote: build failed
2020-Mar-27 08:45:15 :: [i586] #100 python3-module-kiwisolver.git 1.2.0-alt1: build FAILED
2020-Mar-27 08:45:11 :: [aarch64] build FAILED
2020-Mar-27 08:45:12 :: [ppc64le] build FAILED
2020-Mar-27 08:45:13 :: [x86_64] build FAILED
2020-Mar-27 08:45:15 :: [i586] build FAILED
2020-Mar-27 08:45:15 :: task #248652 for sisyphus FAILED


More information about the Sisyphus-incominger mailing list