[#256525] [test-only] FAILED (try 7) range-v3.git=0.11.0-alt1 libowt-tg.git=4.3-alt1

Girar awaiter (lav) girar-builder at altlinux.org
Sun Aug 23 02:52:30 MSK 2020


http://git.altlinux.org/tasks/256525/logs/events.7.1.log

subtask  name       aarch64    armh  i586  ppc64le  x86_64
   #104  libowt-tg   failed  failed  3:54   failed    6:22

2020-Aug-22 23:45:23 :: test-only task #256525 for sisyphus resumed by lav:
#40 build 0.11.0-alt1 from /people/lav/packages/range-v3.git fetched at 2020-Aug-20 17:18:27
#100 removed
#104 build 4.3-alt1 from /people/lav/packages/libowt-tg.git fetched at 2020-Aug-22 23:45:21
#110 removed
#120 removed
#140 removed
#200 removed
2020-Aug-22 23:45:45 :: created build repo
2020-Aug-22 23:45:47 :: [armh] #40 range-v3.git 0.11.0-alt1: build start
2020-Aug-22 23:45:47 :: [x86_64] #40 range-v3.git 0.11.0-alt1: build start
2020-Aug-22 23:45:47 :: [ppc64le] #40 range-v3.git 0.11.0-alt1: build start
2020-Aug-22 23:45:47 :: [i586] #40 range-v3.git 0.11.0-alt1: build start
2020-Aug-22 23:45:47 :: [aarch64] #40 range-v3.git 0.11.0-alt1: build start
2020-Aug-22 23:46:07 :: [i586] range-v3.git 0.11.0-alt1: remote: no need to rebuild
2020-Aug-22 23:46:07 :: [i586] #40 range-v3.git 0.11.0-alt1: build OK
2020-Aug-22 23:46:07 :: [i586] #104 libowt-tg.git 4.3-alt1: build start
2020-Aug-22 23:46:08 :: [x86_64] range-v3.git 0.11.0-alt1: remote: no need to rebuild
2020-Aug-22 23:46:08 :: [x86_64] #40 range-v3.git 0.11.0-alt1: build OK
2020-Aug-22 23:46:08 :: [x86_64] #104 libowt-tg.git 4.3-alt1: build start
2020-Aug-22 23:46:10 :: [aarch64] range-v3.git 0.11.0-alt1: remote: no need to rebuild
2020-Aug-22 23:46:10 :: [aarch64] #40 range-v3.git 0.11.0-alt1: build OK
2020-Aug-22 23:46:10 :: [aarch64] #104 libowt-tg.git 4.3-alt1: build start
2020-Aug-22 23:46:16 :: [ppc64le] range-v3.git 0.11.0-alt1: remote: no need to rebuild
2020-Aug-22 23:46:16 :: [ppc64le] #40 range-v3.git 0.11.0-alt1: build OK
2020-Aug-22 23:46:16 :: [ppc64le] #104 libowt-tg.git 4.3-alt1: build start
2020-Aug-22 23:46:18 :: [armh] range-v3.git 0.11.0-alt1: remote: no need to rebuild
2020-Aug-22 23:46:18 :: [armh] #40 range-v3.git 0.11.0-alt1: build OK
2020-Aug-22 23:46:18 :: [armh] #104 libowt-tg.git 4.3-alt1: build start
[ppc64le] [204/1322] Building CXX object CMakeFiles/tg_owt.dir/src/rtc_base/async_resolver_interface.cc.o
[ppc64le] FAILED: CMakeFiles/tg_owt.dir/src/rtc_base/async_resolver_interface.cc.o 
[ppc64le] /usr/bin/c++ -DHAVE_NETINET_IN_H -DHAVE_WEBRTC_VIDEO -DRTC_ENABLE_VP9 -DWEBRTC_APM_DEBUG_DUMP=0 -DWEBRTC_ENABLE_LINUX_ALSA -DWEBRTC_ENABLE_LINUX_PULSE -DWEBRTC_ENABLE_PROTOBUF=0 -DWEBRTC_INCLUDE_INTERNAL_AUDIO_DEVICE -DWEBRTC_LIBRARY_IMPL -DWEBRTC_LINUX -DWEBRTC_NON_STATIC_TRACE_EVENT_HANDLERS=1 -DWEBRTC_OPUS_VARIABLE_COMPLEXITY=0 -DWEBRTC_POSIX -DWEBRTC_USE_BUILTIN_ISAC_FLOAT -DWEBRTC_USE_H264 -I/usr/include/opus -I../../src/third_party/abseil-cpp -I../../src/third_party/pffft/src -I../../src/third_party/libsrtp/include -I../../src/third_party/libsrtp/crypto/include -I../../src/third_party/usrsctp/usrsctplib -I../../src/third_party/usrsctp/usrsctplib/usrsctplib -I../../src -I../../src/third_party/libyuv/include -g -Wno-deprecated-declarations -Wno-attributes -Wno-narrowing -Wno-return-type -Wall -std=gnu++2a -MD -MT CMakeFiles/tg_owt.dir/src/rtc_base/async_resolver_interface.cc.o -MF CMakeFiles/tg_owt.dir/src/rtc_base/async_resolver_interface.cc.o.d -o CMakeFiles/tg_owt.dir/src/rtc_base/async_resolver_interface.cc.o -c ../../src/rtc_base/async_resolver_interface.cc
[ppc64le] --
[ppc64le]                  from ../../src/rtc_base/async_resolver_interface.cc:11:
[ppc64le] ../../src/rtc_base/system/arch.h:54:2: error: #error Please add support for your architecture in rtc_base/system/arch.h
[ppc64le]    54 | #error Please add support for your architecture in rtc_base/system/arch.h
[ppc64le] ../../src/rtc_base/system/arch.h:58:2: error: #error Define either WEBRTC_ARCH_LITTLE_ENDIAN or WEBRTC_ARCH_BIG_ENDIAN
[ppc64le]    58 | #error Define either WEBRTC_ARCH_LITTLE_ENDIAN or WEBRTC_ARCH_BIG_ENDIAN
[ppc64le] --
[ppc64le] [208/1322] Building CXX object CMakeFiles/tg_owt.dir/src/rtc_base/async_socket.cc.o
[ppc64le] FAILED: CMakeFiles/tg_owt.dir/src/rtc_base/async_socket.cc.o 
[ppc64le] /usr/bin/c++ -DHAVE_NETINET_IN_H -DHAVE_WEBRTC_VIDEO -DRTC_ENABLE_VP9 -DWEBRTC_APM_DEBUG_DUMP=0 -DWEBRTC_ENABLE_LINUX_ALSA -DWEBRTC_ENABLE_LINUX_PULSE -DWEBRTC_ENABLE_PROTOBUF=0 -DWEBRTC_INCLUDE_INTERNAL_AUDIO_DEVICE -DWEBRTC_LIBRARY_IMPL -DWEBRTC_LINUX -DWEBRTC_NON_STATIC_TRACE_EVENT_HANDLERS=1 -DWEBRTC_OPUS_VARIABLE_COMPLEXITY=0 -DWEBRTC_POSIX -DWEBRTC_USE_BUILTIN_ISAC_FLOAT -DWEBRTC_USE_H264 -I/usr/include/opus -I../../src/third_party/abseil-cpp -I../../src/third_party/pffft/src -I../../src/third_party/libsrtp/include -I../../src/third_party/libsrtp/crypto/include -I../../src/third_party/usrsctp/usrsctplib -I../../src/third_party/usrsctp/usrsctplib/usrsctplib -I../../src -I../../src/third_party/libyuv/include -g -Wno-deprecated-declarations -Wno-attributes -Wno-narrowing -Wno-return-type -Wall -std=gnu++2a -MD -MT CMakeFiles/tg_owt.dir/src/rtc_base/async_socket.cc.o -MF CMakeFiles/tg_owt.dir/src/rtc_base/async_socket.cc.o.d -o CMakeFiles/tg_owt.dir/src/rtc_base/async_socket.cc.o -c ../../src/rtc_base/async_socket.cc
[ppc64le] --
[ppc64le]                  from ../../src/rtc_base/async_socket.cc:11:
[ppc64le] ../../src/rtc_base/system/arch.h:54:2: error: #error Please add support for your architecture in rtc_base/system/arch.h
[ppc64le]    54 | #error Please add support for your architecture in rtc_base/system/arch.h
[ppc64le] ../../src/rtc_base/system/arch.h:58:2: error: #error Define either WEBRTC_ARCH_LITTLE_ENDIAN or WEBRTC_ARCH_BIG_ENDIAN
[ppc64le]    58 | #error Define either WEBRTC_ARCH_LITTLE_ENDIAN or WEBRTC_ARCH_BIG_ENDIAN
[ppc64le] [209/1322] Building CXX object CMakeFiles/tg_owt.dir/src/rtc_base/async_packet_socket.cc.o
[ppc64le] FAILED: CMakeFiles/tg_owt.dir/src/rtc_base/async_packet_socket.cc.o 
[ppc64le] /usr/bin/c++ -DHAVE_NETINET_IN_H -DHAVE_WEBRTC_VIDEO -DRTC_ENABLE_VP9 -DWEBRTC_APM_DEBUG_DUMP=0 -DWEBRTC_ENABLE_LINUX_ALSA -DWEBRTC_ENABLE_LINUX_PULSE -DWEBRTC_ENABLE_PROTOBUF=0 -DWEBRTC_INCLUDE_INTERNAL_AUDIO_DEVICE -DWEBRTC_LIBRARY_IMPL -DWEBRTC_LINUX -DWEBRTC_NON_STATIC_TRACE_EVENT_HANDLERS=1 -DWEBRTC_OPUS_VARIABLE_COMPLEXITY=0 -DWEBRTC_POSIX -DWEBRTC_USE_BUILTIN_ISAC_FLOAT -DWEBRTC_USE_H264 -I/usr/include/opus -I../../src/third_party/abseil-cpp -I../../src/third_party/pffft/src -I../../src/third_party/libsrtp/include -I../../src/third_party/libsrtp/crypto/include -I../../src/third_party/usrsctp/usrsctplib -I../../src/third_party/usrsctp/usrsctplib/usrsctplib -I../../src -I../../src/third_party/libyuv/include -g -Wno-deprecated-declarations -Wno-attributes -Wno-narrowing -Wno-return-type -Wall -std=gnu++2a -MD -MT CMakeFiles/tg_owt.dir/src/rtc_base/async_packet_socket.cc.o -MF CMakeFiles/tg_owt.dir/src/rtc_base/async_packet_socket.cc.o.d -o CMakeFiles/tg_owt.dir/src/rtc_base/async_packet_socket.cc.o -c ../../src/rtc_base/async_packet_socket.cc
[ppc64le] --
[ppc64le]                  from ../../src/rtc_base/async_packet_socket.cc:11:
[ppc64le] ../../src/rtc_base/system/arch.h:54:2: error: #error Please add support for your architecture in rtc_base/system/arch.h
[ppc64le]    54 | #error Please add support for your architecture in rtc_base/system/arch.h
[ppc64le] ../../src/rtc_base/system/arch.h:58:2: error: #error Define either WEBRTC_ARCH_LITTLE_ENDIAN or WEBRTC_ARCH_BIG_ENDIAN
[ppc64le]    58 | #error Define either WEBRTC_ARCH_LITTLE_ENDIAN or WEBRTC_ARCH_BIG_ENDIAN
[ppc64le] --
[ppc64le] [212/1322] Building CXX object CMakeFiles/tg_owt.dir/src/rtc_base/async_udp_socket.cc.o
[ppc64le] FAILED: CMakeFiles/tg_owt.dir/src/rtc_base/async_udp_socket.cc.o 
[ppc64le] /usr/bin/c++ -DHAVE_NETINET_IN_H -DHAVE_WEBRTC_VIDEO -DRTC_ENABLE_VP9 -DWEBRTC_APM_DEBUG_DUMP=0 -DWEBRTC_ENABLE_LINUX_ALSA -DWEBRTC_ENABLE_LINUX_PULSE -DWEBRTC_ENABLE_PROTOBUF=0 -DWEBRTC_INCLUDE_INTERNAL_AUDIO_DEVICE -DWEBRTC_LIBRARY_IMPL -DWEBRTC_LINUX -DWEBRTC_NON_STATIC_TRACE_EVENT_HANDLERS=1 -DWEBRTC_OPUS_VARIABLE_COMPLEXITY=0 -DWEBRTC_POSIX -DWEBRTC_USE_BUILTIN_ISAC_FLOAT -DWEBRTC_USE_H264 -I/usr/include/opus -I../../src/third_party/abseil-cpp -I../../src/third_party/pffft/src -I../../src/third_party/libsrtp/include -I../../src/third_party/libsrtp/crypto/include -I../../src/third_party/usrsctp/usrsctplib -I../../src/third_party/usrsctp/usrsctplib/usrsctplib -I../../src -I../../src/third_party/libyuv/include -g -Wno-deprecated-declarations -Wno-attributes -Wno-narrowing -Wno-return-type -Wall -std=gnu++2a -MD -MT CMakeFiles/tg_owt.dir/src/rtc_base/async_udp_socket.cc.o -MF CMakeFiles/tg_owt.dir/src/rtc_base/async_udp_socket.cc.o.d -o CMakeFiles/tg_owt.dir/src/rtc_base/async_udp_socket.cc.o -c ../../src/rtc_base/async_udp_socket.cc
2020-Aug-22 23:47:48 :: [ppc64le] libowt-tg.git 4.3-alt1: remote: build failed
2020-Aug-22 23:47:48 :: [ppc64le] #104 libowt-tg.git 4.3-alt1: build FAILED
2020-Aug-22 23:47:48 :: [ppc64le] requesting cancellation of task processing
[aarch64] [1050/1322] Building CXX object CMakeFiles/tg_owt.dir/src/modules/video_processing/util/denoiser_filter_sse2.cc.o
[aarch64] FAILED: CMakeFiles/tg_owt.dir/src/modules/video_processing/util/denoiser_filter_sse2.cc.o 
[aarch64] /usr/bin/c++ -DHAVE_NETINET_IN_H -DHAVE_WEBRTC_VIDEO -DRTC_ENABLE_VP9 -DWEBRTC_APM_DEBUG_DUMP=0 -DWEBRTC_ENABLE_LINUX_ALSA -DWEBRTC_ENABLE_LINUX_PULSE -DWEBRTC_ENABLE_PROTOBUF=0 -DWEBRTC_INCLUDE_INTERNAL_AUDIO_DEVICE -DWEBRTC_LIBRARY_IMPL -DWEBRTC_LINUX -DWEBRTC_NON_STATIC_TRACE_EVENT_HANDLERS=1 -DWEBRTC_OPUS_VARIABLE_COMPLEXITY=0 -DWEBRTC_POSIX -DWEBRTC_USE_BUILTIN_ISAC_FLOAT -DWEBRTC_USE_H264 -I/usr/include/opus -I../../src/third_party/abseil-cpp -I../../src/third_party/pffft/src -I../../src/third_party/libsrtp/include -I../../src/third_party/libsrtp/crypto/include -I../../src/third_party/usrsctp/usrsctplib -I../../src/third_party/usrsctp/usrsctplib/usrsctplib -I../../src -I../../src/third_party/libyuv/include -g -Wno-deprecated-declarations -Wno-attributes -Wno-narrowing -Wno-return-type -Wall -std=gnu++2a -MD -MT CMakeFiles/tg_owt.dir/src/modules/video_processing/util/denoiser_filter_sse2.cc.o -MF CMakeFiles/tg_owt.dir/src/modules/video_processing/util/denoiser_filter_sse2.cc.o.d -o CMakeFiles/tg_owt.dir/src/modules/video_processing/util/denoiser_filter_sse2.cc.o -c ../../src/modules/video_processing/util/denoiser_filter_sse2.cc
[aarch64] ../../src/modules/video_processing/util/denoiser_filter_sse2.cc:13:10: fatal error: emmintrin.h: No such file or directory
[aarch64]    13 | #include <emmintrin.h>
[aarch64] --
[aarch64] [1058/1322] Building CXX object CMakeFiles/tg_owt.dir/src/common_audio/fir_filter_sse.cc.o
[aarch64] FAILED: CMakeFiles/tg_owt.dir/src/common_audio/fir_filter_sse.cc.o 
[aarch64] /usr/bin/c++ -DHAVE_NETINET_IN_H -DHAVE_WEBRTC_VIDEO -DRTC_ENABLE_VP9 -DWEBRTC_APM_DEBUG_DUMP=0 -DWEBRTC_ENABLE_LINUX_ALSA -DWEBRTC_ENABLE_LINUX_PULSE -DWEBRTC_ENABLE_PROTOBUF=0 -DWEBRTC_INCLUDE_INTERNAL_AUDIO_DEVICE -DWEBRTC_LIBRARY_IMPL -DWEBRTC_LINUX -DWEBRTC_NON_STATIC_TRACE_EVENT_HANDLERS=1 -DWEBRTC_OPUS_VARIABLE_COMPLEXITY=0 -DWEBRTC_POSIX -DWEBRTC_USE_BUILTIN_ISAC_FLOAT -DWEBRTC_USE_H264 -I/usr/include/opus -I../../src/third_party/abseil-cpp -I../../src/third_party/pffft/src -I../../src/third_party/libsrtp/include -I../../src/third_party/libsrtp/crypto/include -I../../src/third_party/usrsctp/usrsctplib -I../../src/third_party/usrsctp/usrsctplib/usrsctplib -I../../src -I../../src/third_party/libyuv/include -g -Wno-deprecated-declarations -Wno-attributes -Wno-narrowing -Wno-return-type -Wall -std=gnu++2a -MD -MT CMakeFiles/tg_owt.dir/src/common_audio/fir_filter_sse.cc.o -MF CMakeFiles/tg_owt.dir/src/common_audio/fir_filter_sse.cc.o.d -o CMakeFiles/tg_owt.dir/src/common_audio/fir_filter_sse.cc.o -c ../../src/common_audio/fir_filter_sse.cc
[aarch64] ../../src/common_audio/fir_filter_sse.cc:15:10: fatal error: xmmintrin.h: No such file or directory
[aarch64]    15 | #include <xmmintrin.h>
[aarch64] --
[aarch64] [1059/1322] Building CXX object CMakeFiles/tg_owt.dir/src/common_audio/resampler/sinc_resampler_sse.cc.o
[aarch64] FAILED: CMakeFiles/tg_owt.dir/src/common_audio/resampler/sinc_resampler_sse.cc.o 
[aarch64] /usr/bin/c++ -DHAVE_NETINET_IN_H -DHAVE_WEBRTC_VIDEO -DRTC_ENABLE_VP9 -DWEBRTC_APM_DEBUG_DUMP=0 -DWEBRTC_ENABLE_LINUX_ALSA -DWEBRTC_ENABLE_LINUX_PULSE -DWEBRTC_ENABLE_PROTOBUF=0 -DWEBRTC_INCLUDE_INTERNAL_AUDIO_DEVICE -DWEBRTC_LIBRARY_IMPL -DWEBRTC_LINUX -DWEBRTC_NON_STATIC_TRACE_EVENT_HANDLERS=1 -DWEBRTC_OPUS_VARIABLE_COMPLEXITY=0 -DWEBRTC_POSIX -DWEBRTC_USE_BUILTIN_ISAC_FLOAT -DWEBRTC_USE_H264 -I/usr/include/opus -I../../src/third_party/abseil-cpp -I../../src/third_party/pffft/src -I../../src/third_party/libsrtp/include -I../../src/third_party/libsrtp/crypto/include -I../../src/third_party/usrsctp/usrsctplib -I../../src/third_party/usrsctp/usrsctplib/usrsctplib -I../../src -I../../src/third_party/libyuv/include -g -Wno-deprecated-declarations -Wno-attributes -Wno-narrowing -Wno-return-type -Wall -std=gnu++2a -MD -MT CMakeFiles/tg_owt.dir/src/common_audio/resampler/sinc_resampler_sse.cc.o -MF CMakeFiles/tg_owt.dir/src/common_audio/resampler/sinc_resampler_sse.cc.o.d -o CMakeFiles/tg_owt.dir/src/common_audio/resampler/sinc_resampler_sse.cc.o -c ../../src/common_audio/resampler/sinc_resampler_sse.cc
[aarch64] ../../src/common_audio/resampler/sinc_resampler_sse.cc:16:10: fatal error: xmmintrin.h: No such file or directory
[aarch64]    16 | #include <xmmintrin.h>
2020-Aug-22 23:47:52 :: [aarch64] libowt-tg.git 4.3-alt1: remote: build failed
2020-Aug-22 23:47:52 :: [aarch64] #104 libowt-tg.git 4.3-alt1: build FAILED
[armh] In file included from ../../src/third_party/pffft/src/pffft.c:155:
[armh] /usr/lib/gcc/armh-alt-linux-gnueabi/9/include/arm_neon.h:9837:1: error: inlining failed in call to always_inline 'vzipq_f32': target specific option mismatch
[armh]  9837 | vzipq_f32 (float32x4_t __a, float32x4_t __b)
[armh] --
[armh] In file included from ../../src/third_party/pffft/src/pffft.c:155:
[armh] /usr/lib/gcc/armh-alt-linux-gnueabi/9/include/arm_neon.h:9837:1: error: inlining failed in call to always_inline 'vzipq_f32': target specific option mismatch
[armh]  9837 | vzipq_f32 (float32x4_t __a, float32x4_t __b)
[armh] --
[armh] In file included from ../../src/third_party/pffft/src/pffft.c:155:
[armh] /usr/lib/gcc/armh-alt-linux-gnueabi/9/include/arm_neon.h:9837:1: error: inlining failed in call to always_inline 'vzipq_f32': target specific option mismatch
[armh]  9837 | vzipq_f32 (float32x4_t __a, float32x4_t __b)
2020-Aug-22 23:48:14 :: [armh] libowt-tg.git 4.3-alt1: remote: build failed
2020-Aug-22 23:48:14 :: [armh] #104 libowt-tg.git 4.3-alt1: build FAILED
2020-Aug-22 23:50:01 :: [i586] #104 libowt-tg.git 4.3-alt1: build OK
2020-Aug-22 23:52:30 :: [x86_64] #104 libowt-tg.git 4.3-alt1: build OK
2020-Aug-22 23:47:48 :: [ppc64le] build FAILED
2020-Aug-22 23:47:52 :: [aarch64] build FAILED
2020-Aug-22 23:48:14 :: [armh] build FAILED
2020-Aug-22 23:52:30 :: task #256525 for sisyphus FAILED


More information about the Sisyphus-incominger mailing list