[#225211] p8 FAILED (try 5) libtdb.git=1.3.16-alt2 libtalloc.git=2.1.14-alt2 ...

Girar Builder awaiter robot girar-builder at altlinux.org
Wed Mar 20 02:55:06 MSK 2019


http://git.altlinux.org/tasks/225211/logs/events.5.1.log

2019-Mar-19 23:36:57 :: test-only task #225211 for p8 resumed by sin:
#100 build 1.3.16-alt2 from /people/sin/packages/libtdb.git fetched at 2019-Mar-18 10:40:14
#200 build 2.1.14-alt2 from /people/sin/packages/libtalloc.git fetched at 2019-Mar-18 10:40:54
#300 build 0.9.37-alt2 from /people/sin/packages/libtevent.git fetched at 2019-Mar-18 10:42:11
#400 removed
#440 build 0.9.23-alt1 from /people/sin/packages/liblmdb.git fetched at 2019-Mar-19 13:07:59
#460 build 1.4.6-alt2 from /people/sin/packages/libldb.git fetched at 2019-Mar-19 17:16:33
#500 removed
#600 removed
#640 build 4.9.5-alt2 from /people/sin/packages/samba.git fetched at 2019-Mar-19 15:39:47
#700 delete samba-DC
#740 removed
#760 removed
#1000 removed
#1040 build 1.16.4-alt1.git486b5523 from /people/sin/packages/sssd.git fetched at 2019-Mar-19 22:34:14
#1100 build 2.4-alt35.zentyal23.1 from /people/sin/packages/openchange.git fetched at 2019-Mar-18 12:25:07
2019-Mar-19 23:50:22 :: created build repo
2019-Mar-19 23:50:24 :: #1040: force rebuild
2019-Mar-19 23:50:24 :: #1100: force rebuild
2019-Mar-19 23:50:24 :: [x86_64] #100 libtdb.git 1.3.16-alt2: build start
2019-Mar-19 23:50:24 :: [i586] #100 libtdb.git 1.3.16-alt2: build start
2019-Mar-19 23:50:57 :: [i586] libtdb.git 1.3.16-alt2: remote: no need to rebuild
2019-Mar-19 23:50:57 :: [i586] #100 libtdb.git 1.3.16-alt2: build OK
2019-Mar-19 23:50:57 :: [i586] #200 libtalloc.git 2.1.14-alt2: build start
2019-Mar-19 23:50:58 :: [x86_64] libtdb.git 1.3.16-alt2: remote: no need to rebuild
2019-Mar-19 23:50:58 :: [x86_64] #100 libtdb.git 1.3.16-alt2: build OK
2019-Mar-19 23:50:58 :: [x86_64] #200 libtalloc.git 2.1.14-alt2: build start
2019-Mar-19 23:51:18 :: [i586] libtalloc.git 2.1.14-alt2: remote: no need to rebuild
2019-Mar-19 23:51:18 :: [i586] #200 libtalloc.git 2.1.14-alt2: build OK
2019-Mar-19 23:51:18 :: [i586] #300 libtevent.git 0.9.37-alt2: build start
2019-Mar-19 23:51:18 :: [x86_64] libtalloc.git 2.1.14-alt2: remote: no need to rebuild
2019-Mar-19 23:51:18 :: [x86_64] #200 libtalloc.git 2.1.14-alt2: build OK
2019-Mar-19 23:51:18 :: [x86_64] #300 libtevent.git 0.9.37-alt2: build start
2019-Mar-19 23:51:39 :: [i586] libtevent.git 0.9.37-alt2: remote: no need to rebuild
2019-Mar-19 23:51:39 :: [i586] #300 libtevent.git 0.9.37-alt2: build OK
2019-Mar-19 23:51:39 :: [i586] #440 liblmdb.git 0.9.23-alt1: build start
2019-Mar-19 23:51:40 :: [x86_64] libtevent.git 0.9.37-alt2: remote: no need to rebuild
2019-Mar-19 23:51:40 :: [x86_64] #300 libtevent.git 0.9.37-alt2: build OK
2019-Mar-19 23:51:40 :: [x86_64] #440 liblmdb.git 0.9.23-alt1: build start
2019-Mar-19 23:51:59 :: [i586] liblmdb.git 0.9.23-alt1: remote: no need to rebuild
2019-Mar-19 23:51:59 :: [i586] #440 liblmdb.git 0.9.23-alt1: build OK
2019-Mar-19 23:51:59 :: [i586] #460 libldb.git 1.4.6-alt2: build start
2019-Mar-19 23:52:00 :: [x86_64] liblmdb.git 0.9.23-alt1: remote: no need to rebuild
2019-Mar-19 23:52:00 :: [x86_64] #440 liblmdb.git 0.9.23-alt1: build OK
2019-Mar-19 23:52:00 :: [x86_64] #460 libldb.git 1.4.6-alt2: build start
2019-Mar-19 23:52:21 :: [i586] libldb.git 1.4.6-alt2: remote: no need to rebuild
2019-Mar-19 23:52:21 :: [i586] #460 libldb.git 1.4.6-alt2: build OK
2019-Mar-19 23:52:21 :: [i586] #640 samba.git 4.9.5-alt2: build start
2019-Mar-19 23:52:22 :: [x86_64] libldb.git 1.4.6-alt2: remote: no need to rebuild
2019-Mar-19 23:52:22 :: [x86_64] #460 libldb.git 1.4.6-alt2: build OK
2019-Mar-19 23:52:23 :: [x86_64] #640 samba.git 4.9.5-alt2: build start
2019-Mar-19 23:52:47 :: [i586] samba.git 4.9.5-alt2: remote: no need to rebuild
2019-Mar-19 23:52:47 :: [i586] #640 samba.git 4.9.5-alt2: build OK
2019-Mar-19 23:52:48 :: [i586] #1040 sssd.git 1.16.4-alt1.git486b5523: build start
2019-Mar-19 23:52:49 :: [x86_64] samba.git 4.9.5-alt2: remote: no need to rebuild
2019-Mar-19 23:52:49 :: [x86_64] #640 samba.git 4.9.5-alt2: build OK
2019-Mar-19 23:52:49 :: [x86_64] #1040 sssd.git 1.16.4-alt1.git486b5523: build start
src/util/tev_curl.c: In function 'curl_code2errno':
src/util/tev_curl.c:113:5: error: duplicate case value
     case CURLE_PEER_FAILED_VERIFICATION:
src/util/tev_curl.c:100:5: error: previously used here
     case CURLE_SSL_CACERT:
2019-Mar-19 23:55:00 :: [x86_64] sssd.git 1.16.4-alt1.git486b5523: remote: build failed
2019-Mar-19 23:55:00 :: [x86_64] #1040 sssd.git 1.16.4-alt1.git486b5523: build FAILED
2019-Mar-19 23:55:00 :: [x86_64] requesting cancellation of task processing
src/util/tev_curl.c: In function 'curl_code2errno':
src/util/tev_curl.c:113:5: error: duplicate case value
     case CURLE_PEER_FAILED_VERIFICATION:
src/util/tev_curl.c:100:5: error: previously used here
     case CURLE_SSL_CACERT:
2019-Mar-19 23:55:06 :: [i586] sssd.git 1.16.4-alt1.git486b5523: remote: build failed
2019-Mar-19 23:55:06 :: [i586] #1040 sssd.git 1.16.4-alt1.git486b5523: build FAILED
2019-Mar-19 23:55:00 :: [x86_64] build FAILED
2019-Mar-19 23:55:06 :: [i586] build FAILED
2019-Mar-19 23:55:06 :: task #225211 for p8 FAILED


More information about the Sisyphus-incominger mailing list