[#231651] [test-only] FAILED srpm=jnr-ffi-2.1.8-alt1_3jpp8.src.rpm

Girar Builder awaiter robot girar-builder at altlinux.org
Thu Jun 6 16:20:48 MSK 2019


http://git.altlinux.org/tasks/231651/logs/events.1.1.log

2019-Jun-06 13:17:55 :: test-only task #231651 for sisyphus started by viy:
#100 build jnr-ffi-2.1.8-alt1_3jpp8.src.rpm
2019-Jun-06 13:17:55 :: [i586] #100 jnr-ffi-2.1.8-alt1_3jpp8.src.rpm: build start
2019-Jun-06 13:17:55 :: [x86_64] #100 jnr-ffi-2.1.8-alt1_3jpp8.src.rpm: build start
2019-Jun-06 13:17:55 :: [aarch64] #100 jnr-ffi-2.1.8-alt1_3jpp8.src.rpm: build start
2019-Jun-06 13:20:08 :: [i586] #100 jnr-ffi-2.1.8-alt1_3jpp8.src.rpm: build OK
2019-Jun-06 13:20:11 :: [x86_64] #100 jnr-ffi-2.1.8-alt1_3jpp8.src.rpm: build OK
[ERROR] Tests run: 1, Failures: 0, Errors: 1, Skipped: 0, Time elapsed: 0.001 s <<< FAILURE! - in jnr.ffi.MemoryIOTest
[ERROR] jnr.ffi.MemoryIOTest  Time elapsed: 0.001 s  <<< ERROR!
java.lang.UnsatisfiedLinkError: could not load FFI provider jnr.ffi.provider.jffi.Provider
	at jnr.ffi.MemoryIOTest.setUpClass(MemoryIOTest.java:64)
--
[ERROR] Tests run: 1, Failures: 0, Errors: 1, Skipped: 0, Time elapsed: 0.001 s <<< FAILURE! - in jnr.ffi.struct.AsciiStringFieldTest
[ERROR] jnr.ffi.struct.AsciiStringFieldTest  Time elapsed: 0.001 s  <<< ERROR!
java.lang.UnsatisfiedLinkError: could not load FFI provider jnr.ffi.provider.jffi.Provider
	at jnr.ffi.struct.AsciiStringFieldTest.setUpClass(AsciiStringFieldTest.java:66)
--
[ERROR] Tests run: 1, Failures: 0, Errors: 1, Skipped: 0, Time elapsed: 0.001 s <<< FAILURE! - in jnr.ffi.struct.UTF8StringFieldTest
[ERROR] jnr.ffi.struct.UTF8StringFieldTest  Time elapsed: 0.001 s  <<< ERROR!
java.lang.UnsatisfiedLinkError: could not load FFI provider jnr.ffi.provider.jffi.Provider
	at jnr.ffi.struct.UTF8StringFieldTest.setUpClass(UTF8StringFieldTest.java:65)
--
[ERROR] Tests run: 1, Failures: 0, Errors: 1, Skipped: 0, Time elapsed: 0.001 s <<< FAILURE! - in jnr.ffi.struct.StructLayoutTest
[ERROR] jnr.ffi.struct.StructLayoutTest  Time elapsed: 0.001 s  <<< ERROR!
java.lang.UnsatisfiedLinkError: could not load FFI provider jnr.ffi.provider.jffi.Provider
	at jnr.ffi.struct.StructLayoutTest.setUpClass(StructLayoutTest.java:57)
--
[ERROR] Tests run: 1, Failures: 0, Errors: 1, Skipped: 0, Time elapsed: 0 s <<< FAILURE! - in jnr.ffi.struct.EnumTest
[ERROR] jnr.ffi.struct.EnumTest  Time elapsed: 0 s  <<< ERROR!
java.lang.UnsatisfiedLinkError: could not load FFI provider jnr.ffi.provider.jffi.Provider
	at jnr.ffi.struct.EnumTest.setUpClass(EnumTest.java:76)
2019-Jun-06 13:20:47 :: [aarch64] jnr-ffi-2.1.8-alt1_3jpp8.src.rpm: remote: build failed
2019-Jun-06 13:20:47 :: [aarch64] #100 jnr-ffi-2.1.8-alt1_3jpp8.src.rpm: build FAILED
2019-Jun-06 13:20:47 :: [aarch64] requesting cancellation of task processing
2019-Jun-06 13:20:47 :: [aarch64] build FAILED
2019-Jun-06 13:20:47 :: task #231651 for sisyphus FAILED


More information about the Sisyphus-incominger mailing list