[#220037] FAILED (try 5) puppet.git=6.3.0-alt1

Girar Builder awaiter robot girar-builder at altlinux.org
Sun Feb 24 22:25:31 MSK 2019


http://git.altlinux.org/tasks/220037/logs/events.5.1.log

2019-Feb-24 19:24:25 :: test-only task #220037 for sisyphus resumed by cas:
#100 removed
#200 removed
#300 build 6.3.0-alt1 from /people/cas/packages/puppet.git fetched at 2019-Feb-24 19:23:17
2019-Feb-24 19:24:26 :: [aarch64] #300 puppet.git 6.3.0-alt1: build start
2019-Feb-24 19:24:26 :: [i586] #300 puppet.git 6.3.0-alt1: build start
2019-Feb-24 19:24:26 :: [x86_64] #300 puppet.git 6.3.0-alt1: build start
<13>Feb 24 19:24:44 rpmi: libidn2-2.1.1-alt1 sisyphus+221274.100.1.2 1549951280 installed
<13>Feb 24 19:24:44 rpmi: libruby-2.5.4-alt2 sisyphus+219587.400.1.1 1547808487 installed
<13>Feb 24 19:24:44 rpmi: rpm-macros-ruby-1:0.7.3-alt1 sisyphus+219657.500.1.1 1548056926 installed
<13>Feb 24 19:24:44 rpmi: libexpat-2.2.4-alt1 1503305341 installed
<13>Feb 24 19:24:44 rpmi: publicsuffix-list-dafsa-20181106-alt1 sisyphus.216228.100 1541611754 installed
<13>Feb 24 19:24:44 rpmi: libpsl-0.20.2-alt2 sisyphus+222635.100.1.1 1550951835 installed
<13>Feb 24 19:24:44 rpmi: libnghttp2-1.34.0-alt1 sisyphus+222625.100.1.1 1550947249 installed
<13>Feb 24 19:24:44 rpmi: libbrotlicommon-1.0.7-alt1 sisyphus.215491.100 1540428591 installed
<13>Feb 24 19:24:44 rpmi: libbrotlidec-1.0.7-alt1 sisyphus.215491.100 1540428591 installed
<13>Feb 24 19:24:44 rpmi: rsync-3.1.3-alt1 1518721083 installed
<13>Feb 24 19:24:44 rpmi: libverto-0.3.0-alt1_5 1525957716 installed
<13>Feb 24 19:24:44 rpmi: libkeyutils-1.6-alt2 sisyphus.217337.100 1544003165 installed
<13>Feb 24 19:24:44 rpmi: libcom_err-1.44.5-alt1 sisyphus+221902.2000.4.1 1550595634 installed
<13>Feb 24 19:24:44 rpmi: libedit3-3.1.20141030-alt1 1414760451 installed
<13>Feb 24 19:24:44 rpmi: less-481-alt2 1477575585 installed
<13>Feb 24 19:24:44 rpmi: diffstat-1.62-alt1 sisyphus+221902.1600.4.1 1550595227 installed
<13>Feb 24 19:24:44 rpmi: libtasn1-4.13-alt2 1521133848 installed
<13>Feb 24 19:24:44 rpmi: libp11-kit-0.23.9-alt5 1525798241 installed
<13>Feb 24 19:24:44 rpmi: libgdbm-1.8.3-alt10 1454943313 installed
<13>Feb 24 19:24:44 rpmi: libyaml2-0.2.1-alt1 sisyphus+222676.100.1.1 1550991396 installed
<13>Feb 24 19:24:44 rpmi: rpm-macros-alternatives-0.5.0-alt1 sisyphus+221902.300.4.1 1550587121 installed
<13>Feb 24 19:24:44 rpmi: alternatives-0.5.0-alt1 sisyphus+221902.300.4.1 1550587121 installed
<13>Feb 24 19:24:44 rpmi: ca-certificates-2019.02.01-alt1 sisyphus+220384.200.1.1 1549032756 installed
<13>Feb 24 19:24:44 rpmi: ca-trust-0.1.1-alt2 1515595785 installed
<13>Feb 24 19:24:44 rpmi: p11-kit-trust-0.23.9-alt5 1525798241 installed
<13>Feb 24 19:24:45 rpmi: libcrypto1.1-1.1.0j-alt1 sisyphus.216647.100 1542743840 installed
<13>Feb 24 19:24:45 rpmi: libssl1.1-1.1.0j-alt1 sisyphus.216647.100 1542743840 installed
<13>Feb 24 19:24:45 rpmi: ruby-rubygems-update-3.0.1-alt1 sisyphus+218713.1100.2.1 1547736306 installed
<13>Feb 24 19:24:45 rpmi: gem-did-you-mean-1.3.0-alt1 sisyphus+219587.100.1.1 1547808061 installed
<13>Feb 24 19:24:45 rpmi: ruby-minitest-5.11.3-alt1 sisyphus+219345.3500.8.1 1547631954 installed
<13>Feb 24 19:24:45 rpmi: ruby-net-telnet-0.2.0-alt1 sisyphus+219345.2700.8.1 1547631566 installed
<13>Feb 24 19:24:45 rpmi: gem-power-assert-1.1.3-alt1 sisyphus+219345.3200.8.1 1547631761 installed
<13>Feb 24 19:24:45 rpmi: rake-12.3.2-alt2 sisyphus+218713.60.1.1 1547734935 installed
<13>Feb 24 19:24:45 rpmi: ruby-rake-12.3.2-alt2 sisyphus+218713.60.1.1 1547734935 installed
<13>Feb 24 19:24:45 rpmi: ruby-test-unit-1:3.2.9-alt1 sisyphus+219345.3100.8.1 1547631703 installed
<13>Feb 24 19:24:45 rpmi: ruby-xmlrpc-0.3.0-alt1 sisyphus+219345.3300.8.1 1547631818 installed
<13>Feb 24 19:24:45 rpmi: gem-2.5.4-alt2 sisyphus+219587.400.1.1 1547808487 installed
<13>Feb 24 19:24:45 rpmi: ruby-rdoc-6.1.1-alt2 sisyphus+219587.200.1.1 1547808132 installed
<13>Feb 24 19:24:45 rpmi: ruby-stdlibs-2.5.4-alt2 sisyphus+219587.400.1.1 1547808487 installed
<13>Feb 24 19:24:45 rpmi: ri-6.1.1-alt2 sisyphus+219587.200.1.1 1547808132 installed
<13>Feb 24 19:24:45 rpmi: rdoc-6.1.1-alt2 sisyphus+219587.200.1.1 1547808132 installed
<13>Feb 24 19:24:45 rpmi: erb-2.5.4-alt2 sisyphus+219587.400.1.1 1547808487 installed
<13>Feb 24 19:24:45 rpmi: irb-2.5.4-alt2 sisyphus+219587.400.1.1 1547808487 installed
<13>Feb 24 19:24:45 rpmi: ruby-bundler-2.0.1-alt1 sisyphus+218713.700.2.1 1547736109 installed
<13>Feb 24 19:24:45 rpmi: bundle-2.0.1-alt1 sisyphus+218713.700.2.1 1547736109 installed
<13>Feb 24 19:24:45 rpmi: ruby-2.5.4-alt2 sisyphus+219587.400.1.1 1547808487 installed
<86>Feb 24 19:24:45 groupadd[22960]: group added to /etc/group: name=_keytab, GID=499
<86>Feb 24 19:24:45 groupadd[22960]: group added to /etc/gshadow: name=_keytab
<86>Feb 24 19:24:45 groupadd[22960]: new group: name=_keytab, GID=499
<13>Feb 24 19:24:45 rpmi: libkrb5-1.16.3-alt1 sisyphus.219042.100 1547045738 installed
<86>Feb 24 19:24:45 groupadd[22965]: group added to /etc/group: name=sasl, GID=498
<86>Feb 24 19:24:45 groupadd[22965]: group added to /etc/gshadow: name=sasl
<86>Feb 24 19:24:45 groupadd[22965]: new group: name=sasl, GID=498
<13>Feb 24 19:24:45 rpmi: libsasl2-3-2.1.27-alt1 sisyphus.218476.200 1545647744 installed
<13>Feb 24 19:24:45 rpmi: libldap-2.4.46-alt1.1 sisyphus+219907.4400.1.1 1548349656 installed
<13>Feb 24 19:24:45 rpmi: libcurl-7.64.0-alt1 sisyphus+220787.100.1.1 1549439378 installed
<13>Feb 24 19:24:45 rpmi: openssh-common-7.9p1-alt1 sisyphus.215513.200 1541525251 installed
<86>Feb 24 19:24:45 groupadd[22970]: group added to /etc/group: name=sshagent, GID=497
<86>Feb 24 19:24:45 groupadd[22970]: group added to /etc/gshadow: name=sshagent
<86>Feb 24 19:24:45 groupadd[22970]: new group: name=sshagent, GID=497
<13>Feb 24 19:24:45 rpmi: openssh-clients-7.9p1-alt1 sisyphus.215513.200 1541525251 installed
<13>Feb 24 19:24:46 rpmi: git-core-2.19.2-alt1 sisyphus+221902.2700.4.1 1550597205 installed
<13>Feb 24 19:24:46 rpmi: ruby-tool-setup-3.4.1-alt13 sisyphus.213465.100 1537944495 installed
<13>Feb 24 19:24:46 rpmi: libruby-devel-2.5.4-alt2 sisyphus+219587.400.1.1 1547808487 installed
<13>Feb 24 19:24:46 rpmi: rpm-build-ruby-1:0.7.3-alt1 sisyphus+219657.500.1.1 1548056926 installed
<13>Feb 24 19:24:50 rpmi: pciids-20190218-alt1 sisyphus+221962.100.1.1 1550531383 installed
<13>Feb 24 19:24:50 rpmi: ethtool-1:4.11-alt1 1507675444 installed
<13>Feb 24 19:24:50 rpmi: libpci-3.6.2-alt1.S1 sisyphus.213446.100 1537513663 installed
<13>Feb 24 19:24:50 rpmi: pciutils-3.6.2-alt1.S1 sisyphus.213446.100 1537513663 installed
<13>Feb 24 19:24:50 rpmi: hostinfo-2.2-alt6 1366317204 installed
<13>Feb 24 19:24:50 rpmi: etherwake-1.09-alt1.qa1 1366056759 installed
<13>Feb 24 19:24:50 rpmi: net-tools-1.60-alt19 1498647052 installed
<13>Feb 24 19:24:50 rpmi: dmidecode-3.2-alt2 sisyphus+219481.100.1.1 1547641933 installed
<13>Feb 24 19:24:50 rpmi: libjson-c-0.12.1-alt2 1517446108 installed
<13>Feb 24 19:24:50 rpmi: libbind-9.11.5.P4-alt1 sisyphus+222440.100.1.1 1550825250 installed
<13>Feb 24 19:24:50 rpmi: bind-utils-9.11.5.P4-alt1 sisyphus+222440.100.1.1 1550825250 installed
<13>Feb 24 19:24:50 rpmi: ruby-facter-2.5.1-alt2 sisyphus.218258.100 1545341362 installed
<13>Feb 24 19:24:50 rpmi: ruby-hiera-3.4.5-alt1 sisyphus.213262.100 1537335107 installed
error: File /usr/src/in/source/puppet-6.3.0.patch: No such file or directory
Building target platforms: x86_64
Building for target x86_64
hsh-rebuild: pkg.tar: failed to create src.rpm file
2019-Feb-24 19:24:50 :: [x86_64] puppet.git 6.3.0-alt1: remote: cannot build src.rpm
2019-Feb-24 19:24:50 :: [x86_64] #300 puppet.git 6.3.0-alt1: build FAILED
<13>Feb 24 19:24:44 rpmi: libidn2-2.1.1-alt1 sisyphus+221274.100.1.2 1549951289 installed
<13>Feb 24 19:24:44 rpmi: libruby-2.5.4-alt2 sisyphus+219587.400.1.1 1547808517 installed
<13>Feb 24 19:24:44 rpmi: rpm-macros-ruby-1:0.7.3-alt1 sisyphus+219657.500.1.1 1548056926 installed
<13>Feb 24 19:24:44 rpmi: libexpat-2.2.4-alt1 1503305345 installed
<13>Feb 24 19:24:44 rpmi: publicsuffix-list-dafsa-20181106-alt1 sisyphus.216228.100 1541611754 installed
<13>Feb 24 19:24:44 rpmi: libpsl-0.20.2-alt2 sisyphus+222635.100.1.1 1550951841 installed
<13>Feb 24 19:24:44 rpmi: libnghttp2-1.34.0-alt1 sisyphus+222625.100.1.1 1550947259 installed
<13>Feb 24 19:24:44 rpmi: libbrotlicommon-1.0.7-alt1 sisyphus.215491.100 1540428597 installed
<13>Feb 24 19:24:44 rpmi: libbrotlidec-1.0.7-alt1 sisyphus.215491.100 1540428597 installed
<13>Feb 24 19:24:44 rpmi: rsync-3.1.3-alt1 1518721086 installed
<13>Feb 24 19:24:44 rpmi: libverto-0.3.0-alt1_5 1525957714 installed
<13>Feb 24 19:24:44 rpmi: libkeyutils-1.6-alt2 sisyphus.217337.100 1544003161 installed
<13>Feb 24 19:24:44 rpmi: libcom_err-1.44.5-alt1 sisyphus+221902.2000.4.1 1550595809 installed
<13>Feb 24 19:24:44 rpmi: libedit3-3.1.20141030-alt1 1414760452 installed
<13>Feb 24 19:24:44 rpmi: less-481-alt2 1477575586 installed
<13>Feb 24 19:24:44 rpmi: diffstat-1.62-alt1 sisyphus+221902.1600.4.1 1550595368 installed
<13>Feb 24 19:24:44 rpmi: libtasn1-4.13-alt2 1521133850 installed
<13>Feb 24 19:24:44 rpmi: libp11-kit-0.23.9-alt5 1525798298 installed
<13>Feb 24 19:24:44 rpmi: libgdbm-1.8.3-alt10 1454943334 installed
<13>Feb 24 19:24:44 rpmi: libyaml2-0.2.1-alt1 sisyphus+222676.100.1.1 1550991397 installed
<13>Feb 24 19:24:44 rpmi: rpm-macros-alternatives-0.5.0-alt1 sisyphus+221902.300.4.1 1550587121 installed
<13>Feb 24 19:24:44 rpmi: alternatives-0.5.0-alt1 sisyphus+221902.300.4.1 1550587121 installed
<13>Feb 24 19:24:44 rpmi: ca-certificates-2019.02.01-alt1 sisyphus+220384.200.1.1 1549032756 installed
<13>Feb 24 19:24:44 rpmi: ca-trust-0.1.1-alt2 1515595785 installed
<13>Feb 24 19:24:44 rpmi: p11-kit-trust-0.23.9-alt5 1525798298 installed
<13>Feb 24 19:24:44 rpmi: libcrypto1.1-1.1.0j-alt1 sisyphus.216647.100 1542743878 installed
<13>Feb 24 19:24:44 rpmi: libssl1.1-1.1.0j-alt1 sisyphus.216647.100 1542743878 installed
<13>Feb 24 19:24:44 rpmi: ruby-rubygems-update-3.0.1-alt1 sisyphus+218713.1100.2.1 1547736306 installed
<13>Feb 24 19:24:44 rpmi: gem-did-you-mean-1.3.0-alt1 sisyphus+219587.100.1.1 1547808061 installed
<13>Feb 24 19:24:44 rpmi: ruby-minitest-5.11.3-alt1 sisyphus+219345.3500.8.1 1547631954 installed
<13>Feb 24 19:24:44 rpmi: ruby-net-telnet-0.2.0-alt1 sisyphus+219345.2700.8.1 1547631566 installed
<13>Feb 24 19:24:44 rpmi: gem-power-assert-1.1.3-alt1 sisyphus+219345.3200.8.1 1547631761 installed
<13>Feb 24 19:24:44 rpmi: rake-12.3.2-alt2 sisyphus+218713.60.1.1 1547734935 installed
<13>Feb 24 19:24:44 rpmi: ruby-rake-12.3.2-alt2 sisyphus+218713.60.1.1 1547734935 installed
<13>Feb 24 19:24:44 rpmi: ruby-test-unit-1:3.2.9-alt1 sisyphus+219345.3100.8.1 1547631703 installed
<13>Feb 24 19:24:44 rpmi: ruby-xmlrpc-0.3.0-alt1 sisyphus+219345.3300.8.1 1547631818 installed
<13>Feb 24 19:24:44 rpmi: gem-2.5.4-alt2 sisyphus+219587.400.1.1 1547808487 installed
<13>Feb 24 19:24:44 rpmi: ruby-rdoc-6.1.1-alt2 sisyphus+219587.200.1.1 1547808132 installed
<13>Feb 24 19:24:45 rpmi: ruby-stdlibs-2.5.4-alt2 sisyphus+219587.400.1.1 1547808517 installed
<13>Feb 24 19:24:45 rpmi: ri-6.1.1-alt2 sisyphus+219587.200.1.1 1547808132 installed
<13>Feb 24 19:24:45 rpmi: rdoc-6.1.1-alt2 sisyphus+219587.200.1.1 1547808132 installed
<13>Feb 24 19:24:45 rpmi: erb-2.5.4-alt2 sisyphus+219587.400.1.1 1547808487 installed
<13>Feb 24 19:24:45 rpmi: irb-2.5.4-alt2 sisyphus+219587.400.1.1 1547808487 installed
<13>Feb 24 19:24:45 rpmi: ruby-bundler-2.0.1-alt1 sisyphus+218713.700.2.1 1547736109 installed
<13>Feb 24 19:24:45 rpmi: bundle-2.0.1-alt1 sisyphus+218713.700.2.1 1547736109 installed
<13>Feb 24 19:24:45 rpmi: ruby-2.5.4-alt2 sisyphus+219587.400.1.1 1547808517 installed
<86>Feb 24 19:24:45 groupadd[16279]: group added to /etc/group: name=_keytab, GID=499
<86>Feb 24 19:24:45 groupadd[16279]: group added to /etc/gshadow: name=_keytab
<86>Feb 24 19:24:45 groupadd[16279]: new group: name=_keytab, GID=499
<13>Feb 24 19:24:45 rpmi: libkrb5-1.16.3-alt1 sisyphus.219042.100 1547045815 installed
<86>Feb 24 19:24:45 groupadd[16284]: group added to /etc/group: name=sasl, GID=498
<86>Feb 24 19:24:45 groupadd[16284]: group added to /etc/gshadow: name=sasl
<86>Feb 24 19:24:45 groupadd[16284]: new group: name=sasl, GID=498
<13>Feb 24 19:24:45 rpmi: libsasl2-3-2.1.27-alt1 sisyphus.218476.200 1545647755 installed
<13>Feb 24 19:24:45 rpmi: libldap-2.4.46-alt1.1 sisyphus+219907.4400.1.1 1548349979 installed
<13>Feb 24 19:24:45 rpmi: libcurl-7.64.0-alt1 sisyphus+220787.100.1.1 1549439379 installed
<13>Feb 24 19:24:45 rpmi: openssh-common-7.9p1-alt1 sisyphus.215513.200 1541525253 installed
<86>Feb 24 19:24:45 groupadd[16289]: group added to /etc/group: name=sshagent, GID=497
<86>Feb 24 19:24:45 groupadd[16289]: group added to /etc/gshadow: name=sshagent
<86>Feb 24 19:24:45 groupadd[16289]: new group: name=sshagent, GID=497
<13>Feb 24 19:24:45 rpmi: openssh-clients-7.9p1-alt1 sisyphus.215513.200 1541525253 installed
<13>Feb 24 19:24:46 rpmi: git-core-2.19.2-alt1 sisyphus+221902.2700.4.1 1550597413 installed
<13>Feb 24 19:24:46 rpmi: ruby-tool-setup-3.4.1-alt13 sisyphus.213465.100 1537944495 installed
<13>Feb 24 19:24:46 rpmi: libruby-devel-2.5.4-alt2 sisyphus+219587.400.1.1 1547808517 installed
<13>Feb 24 19:24:46 rpmi: rpm-build-ruby-1:0.7.3-alt1 sisyphus+219657.500.1.1 1548056926 installed
<13>Feb 24 19:24:50 rpmi: pciids-20190218-alt1 sisyphus+221962.100.1.1 1550531383 installed
<13>Feb 24 19:24:50 rpmi: ethtool-1:4.11-alt1 1507675445 installed
<13>Feb 24 19:24:50 rpmi: libpci-3.6.2-alt1.S1 sisyphus.213446.100 1537513661 installed
<13>Feb 24 19:24:50 rpmi: pciutils-3.6.2-alt1.S1 sisyphus.213446.100 1537513661 installed
<13>Feb 24 19:24:50 rpmi: hostinfo-2.2-alt6 1366317205 installed
<13>Feb 24 19:24:50 rpmi: etherwake-1.09-alt1.qa1 1366056759 installed
<13>Feb 24 19:24:50 rpmi: net-tools-1.60-alt19 1498647054 installed
<13>Feb 24 19:24:50 rpmi: dmidecode-3.2-alt2 sisyphus+219481.100.1.1 1547641933 installed
<13>Feb 24 19:24:50 rpmi: libjson-c-0.12.1-alt2 1517446106 installed
<13>Feb 24 19:24:50 rpmi: libbind-9.11.5.P4-alt1 sisyphus+222440.100.1.1 1550825281 installed
<13>Feb 24 19:24:50 rpmi: bind-utils-9.11.5.P4-alt1 sisyphus+222440.100.1.1 1550825281 installed
<13>Feb 24 19:24:50 rpmi: ruby-facter-2.5.1-alt2 sisyphus.218258.100 1545341362 installed
<13>Feb 24 19:24:50 rpmi: ruby-hiera-3.4.5-alt1 sisyphus.213262.100 1537335107 installed
error: File /usr/src/in/source/puppet-6.3.0.patch: No such file or directory
Building target platforms: i586
Building for target i586
hsh-rebuild: pkg.tar: failed to create src.rpm file
2019-Feb-24 19:24:50 :: [i586] puppet.git 6.3.0-alt1: remote: cannot build src.rpm
2019-Feb-24 19:24:50 :: [i586] #300 puppet.git 6.3.0-alt1: build FAILED
<13>Feb 24 19:25:15 rpmi: libidn2-2.1.1-alt1 sisyphus+221274.100.1.2 1549951431 installed
<13>Feb 24 19:25:15 rpmi: libruby-2.5.4-alt2 sisyphus+219587.400.1.1 1547809301 installed
<13>Feb 24 19:25:15 rpmi: rpm-macros-ruby-1:0.7.3-alt1 sisyphus+219657.500.1.1 1548056926 installed
<13>Feb 24 19:25:15 rpmi: libexpat-2.2.4-alt1 1503383835 installed
<13>Feb 24 19:25:15 rpmi: publicsuffix-list-dafsa-20181106-alt1 sisyphus.216228.100 1541611754 installed
<13>Feb 24 19:25:15 rpmi: libpsl-0.20.2-alt2 sisyphus+222635.100.1.1 1550951999 installed
<13>Feb 24 19:25:15 rpmi: libnghttp2-1.34.0-alt1 sisyphus+222625.100.1.1 1550947653 installed
<13>Feb 24 19:25:16 rpmi: libbrotlicommon-1.0.7-alt1 sisyphus.215491.100 1540428697 installed
<13>Feb 24 19:25:16 rpmi: libbrotlidec-1.0.7-alt1 sisyphus.215491.100 1540428697 installed
<13>Feb 24 19:25:16 rpmi: rsync-3.1.3-alt1 1518769492 installed
<13>Feb 24 19:25:16 rpmi: libverto-0.3.0-alt1_5 1525973999 installed
<13>Feb 24 19:25:16 rpmi: libkeyutils-1.6-alt2 sisyphus.217337.100 1544003241 installed
<13>Feb 24 19:25:16 rpmi: libcom_err-1.44.5-alt1 sisyphus+221902.2000.4.1 1550600847 installed
<13>Feb 24 19:25:16 rpmi: libedit3-3.1.20141030-alt1 1441573233 installed
<13>Feb 24 19:25:16 rpmi: less-481-alt2 1477657360 installed
<13>Feb 24 19:25:16 rpmi: diffstat-1.62-alt1 sisyphus+221902.1600.4.1 1550599869 installed
<13>Feb 24 19:25:16 rpmi: libtasn1-4.13-alt2 1521196133 installed
<13>Feb 24 19:25:16 rpmi: libp11-kit-0.23.9-alt5 1525878029 installed
<13>Feb 24 19:25:16 rpmi: libgdbm-1.8.3-alt10 1455054876 installed
<13>Feb 24 19:25:16 rpmi: libyaml2-0.2.1-alt1 sisyphus+222676.100.1.1 1550991475 installed
<13>Feb 24 19:25:16 rpmi: rpm-macros-alternatives-0.5.0-alt1 sisyphus+221902.300.4.1 1550587121 installed
<13>Feb 24 19:25:16 rpmi: alternatives-0.5.0-alt1 sisyphus+221902.300.4.1 1550587121 installed
<13>Feb 24 19:25:16 rpmi: ca-certificates-2019.02.01-alt1 sisyphus+220384.200.1.1 1549032756 installed
<13>Feb 24 19:25:16 rpmi: ca-trust-0.1.1-alt2 1515595785 installed
<13>Feb 24 19:25:16 rpmi: p11-kit-trust-0.23.9-alt5 1525878029 installed
<13>Feb 24 19:25:16 rpmi: libcrypto1.1-1.1.0j-alt1 sisyphus.216647.100 1542744308 installed
<13>Feb 24 19:25:16 rpmi: libssl1.1-1.1.0j-alt1 sisyphus.216647.100 1542744308 installed
<13>Feb 24 19:25:16 rpmi: ruby-rubygems-update-3.0.1-alt1 sisyphus+218713.1100.2.1 1547736306 installed
<13>Feb 24 19:25:16 rpmi: gem-did-you-mean-1.3.0-alt1 sisyphus+219587.100.1.1 1547808061 installed
<13>Feb 24 19:25:16 rpmi: ruby-minitest-5.11.3-alt1 sisyphus+219345.3500.8.1 1547631954 installed
<13>Feb 24 19:25:16 rpmi: ruby-net-telnet-0.2.0-alt1 sisyphus+219345.2700.8.1 1547631566 installed
<13>Feb 24 19:25:16 rpmi: gem-power-assert-1.1.3-alt1 sisyphus+219345.3200.8.1 1547631761 installed
<13>Feb 24 19:25:16 rpmi: rake-12.3.2-alt2 sisyphus+218713.60.1.1 1547734935 installed
<13>Feb 24 19:25:16 rpmi: ruby-rake-12.3.2-alt2 sisyphus+218713.60.1.1 1547734935 installed
<13>Feb 24 19:25:16 rpmi: ruby-test-unit-1:3.2.9-alt1 sisyphus+219345.3100.8.1 1547631703 installed
<13>Feb 24 19:25:16 rpmi: ruby-xmlrpc-0.3.0-alt1 sisyphus+219345.3300.8.1 1547631818 installed
<13>Feb 24 19:25:16 rpmi: gem-2.5.4-alt2 sisyphus+219587.400.1.1 1547808487 installed
<13>Feb 24 19:25:16 rpmi: ruby-rdoc-6.1.1-alt2 sisyphus+219587.200.1.1 1547808132 installed
<13>Feb 24 19:25:17 rpmi: ruby-stdlibs-2.5.4-alt2 sisyphus+219587.400.1.1 1547809301 installed
<13>Feb 24 19:25:17 rpmi: ri-6.1.1-alt2 sisyphus+219587.200.1.1 1547808132 installed
<13>Feb 24 19:25:17 rpmi: rdoc-6.1.1-alt2 sisyphus+219587.200.1.1 1547808132 installed
<13>Feb 24 19:25:17 rpmi: erb-2.5.4-alt2 sisyphus+219587.400.1.1 1547808487 installed
<13>Feb 24 19:25:17 rpmi: irb-2.5.4-alt2 sisyphus+219587.400.1.1 1547808487 installed
<13>Feb 24 19:25:17 rpmi: ruby-bundler-2.0.1-alt1 sisyphus+218713.700.2.1 1547736109 installed
<13>Feb 24 19:25:17 rpmi: bundle-2.0.1-alt1 sisyphus+218713.700.2.1 1547736109 installed
<13>Feb 24 19:25:17 rpmi: ruby-2.5.4-alt2 sisyphus+219587.400.1.1 1547809301 installed
<86>Feb 24 19:25:17 groupadd[15696]: group added to /etc/group: name=_keytab, GID=499
<86>Feb 24 19:25:17 groupadd[15696]: group added to /etc/gshadow: name=_keytab
<86>Feb 24 19:25:17 groupadd[15696]: new group: name=_keytab, GID=499
<13>Feb 24 19:25:17 rpmi: libkrb5-1.16.3-alt1 sisyphus.219042.100 1547046514 installed
<86>Feb 24 19:25:17 groupadd[15701]: group added to /etc/group: name=sasl, GID=498
<86>Feb 24 19:25:17 groupadd[15701]: group added to /etc/gshadow: name=sasl
<86>Feb 24 19:25:17 groupadd[15701]: new group: name=sasl, GID=498
<13>Feb 24 19:25:17 rpmi: libsasl2-3-2.1.27-alt1 sisyphus.218476.200 1545647927 installed
<13>Feb 24 19:25:17 rpmi: libldap-2.4.46-alt1.1 sisyphus+219907.4400.1.1 1548356935 installed
<13>Feb 24 19:25:17 rpmi: libcurl-7.64.0-alt1 sisyphus+220787.100.1.1 1549439637 installed
<13>Feb 24 19:25:18 rpmi: openssh-common-7.9p1-alt1 sisyphus.215513.200 1541525454 installed
<86>Feb 24 19:25:18 groupadd[15706]: group added to /etc/group: name=sshagent, GID=497
<86>Feb 24 19:25:18 groupadd[15706]: group added to /etc/gshadow: name=sshagent
<86>Feb 24 19:25:18 groupadd[15706]: new group: name=sshagent, GID=497
<13>Feb 24 19:25:18 rpmi: openssh-clients-7.9p1-alt1 sisyphus.215513.200 1541525454 installed
<13>Feb 24 19:25:18 rpmi: git-core-2.19.2-alt1 sisyphus+221902.2700.4.1 1550604371 installed
<13>Feb 24 19:25:18 rpmi: ruby-tool-setup-3.4.1-alt13 sisyphus.213465.100 1537944495 installed
<13>Feb 24 19:25:18 rpmi: libruby-devel-2.5.4-alt2 sisyphus+219587.400.1.1 1547809301 installed
<13>Feb 24 19:25:18 rpmi: rpm-build-ruby-1:0.7.3-alt1 sisyphus+219657.500.1.1 1548056926 installed
<13>Feb 24 19:25:29 rpmi: pciids-20190218-alt1 sisyphus+221962.100.1.1 1550531383 installed
<13>Feb 24 19:25:29 rpmi: ethtool-1:4.11-alt1 1507797836 installed
<13>Feb 24 19:25:29 rpmi: libpci-3.6.2-alt1.S1 sisyphus.213446.100 1537513738 installed
<13>Feb 24 19:25:29 rpmi: pciutils-3.6.2-alt1.S1 sisyphus.213446.100 1537513738 installed
<13>Feb 24 19:25:29 rpmi: hostinfo-2.2-alt6 1447679775 installed
<13>Feb 24 19:25:29 rpmi: etherwake-1.09-alt1.qa1 1447680178 installed
<13>Feb 24 19:25:29 rpmi: net-tools-1.60-alt19 1498719943 installed
<13>Feb 24 19:25:29 rpmi: dmidecode-3.2-alt2 sisyphus+219481.100.1.1 1547641981 installed
<13>Feb 24 19:25:29 rpmi: libjson-c-0.12.1-alt2 1517560741 installed
<13>Feb 24 19:25:29 rpmi: libbind-9.11.5.P4-alt1 sisyphus+222440.100.1.1 1550825729 installed
<13>Feb 24 19:25:29 rpmi: bind-utils-9.11.5.P4-alt1 sisyphus+222440.100.1.1 1550825729 installed
<13>Feb 24 19:25:29 rpmi: ruby-facter-2.5.1-alt2 sisyphus.218258.100 1545341362 installed
<13>Feb 24 19:25:29 rpmi: ruby-hiera-3.4.5-alt1 sisyphus.213262.100 1537335107 installed
error: File /usr/src/in/source/puppet-6.3.0.patch: No such file or directory
Building target platforms: aarch64
Building for target aarch64
hsh-rebuild: pkg.tar: failed to create src.rpm file
2019-Feb-24 19:25:30 :: [aarch64] puppet.git 6.3.0-alt1: remote: cannot build src.rpm
2019-Feb-24 19:25:30 :: [aarch64] #300 puppet.git 6.3.0-alt1: build FAILED
2019-Feb-24 19:24:50 :: [x86_64] build FAILED
2019-Feb-24 19:24:50 :: [i586] build FAILED
2019-Feb-24 19:25:30 :: [aarch64] build FAILED
2019-Feb-24 19:25:30 :: task #220037 for sisyphus FAILED


More information about the Sisyphus-incominger mailing list