[#214159] FAILED srpm=python-module-heatclient-1.16.1-alt1.src.rpm

Girar Builder awaiter robot girar-builder at altlinux.org
Fri Oct 5 20:53:20 MSK 2018


http://git.altlinux.org/tasks/214159/logs/events.1.1.log

2018-Oct-05 17:50:56 :: test-only task #214159 for sisyphus started by grenka:
#100 build python-module-heatclient-1.16.1-alt1.src.rpm
2018-Oct-05 17:50:56 :: [i586] #100 python-module-heatclient-1.16.1-alt1.src.rpm: build start
2018-Oct-05 17:50:56 :: [aarch64] #100 python-module-heatclient-1.16.1-alt1.src.rpm: build start
2018-Oct-05 17:50:56 :: [x86_64] #100 python-module-heatclient-1.16.1-alt1.src.rpm: build start
connecting events for openstackdocstheme
Extension error:
Could not import extension cliff.sphinxext (exception: No module named sphinxext)
2018-Oct-05 17:51:49 :: [x86_64] python-module-heatclient-1.16.1-alt1.src.rpm: remote: build failed
2018-Oct-05 17:51:49 :: [x86_64] #100 python-module-heatclient-1.16.1-alt1.src.rpm: build FAILED
connecting events for openstackdocstheme
Extension error:
Could not import extension cliff.sphinxext (exception: No module named sphinxext)
2018-Oct-05 17:51:52 :: [i586] python-module-heatclient-1.16.1-alt1.src.rpm: remote: build failed
2018-Oct-05 17:51:52 :: [i586] #100 python-module-heatclient-1.16.1-alt1.src.rpm: build FAILED
connecting events for openstackdocstheme
Extension error:
Could not import extension cliff.sphinxext (exception: No module named sphinxext)
2018-Oct-05 17:53:20 :: [aarch64] python-module-heatclient-1.16.1-alt1.src.rpm: remote: build failed
2018-Oct-05 17:53:20 :: [aarch64] #100 python-module-heatclient-1.16.1-alt1.src.rpm: build FAILED
2018-Oct-05 17:51:49 :: [x86_64] build FAILED
2018-Oct-05 17:51:52 :: [i586] build FAILED
2018-Oct-05 17:53:20 :: [aarch64] build FAILED
2018-Oct-05 17:53:20 :: task #214159 for sisyphus FAILED


More information about the Sisyphus-incominger mailing list