[#203053] FAILED (try 4) python-module-blessed.git=1.14.2-alt1

Girar Builder awaiter robot girar-builder at altlinux.org
Tue Mar 27 18:04:15 MSK 2018


http://git.altlinux.org/tasks/203053/logs/events.4.1.log

2018-Mar-27 15:03:21 :: test-only task #203053 for sisyphus resumed by mrdrew:
#100 removed
#200 removed
#300 removed
#400 build 1.14.2-alt1 from /people/mrdrew/packages/python-module-blessed.git fetched at 2018-Mar-27 15:03:11
2018-Mar-27 15:03:22 :: [i586] #400 python-module-blessed.git 1.14.2-alt1: build start
2018-Mar-27 15:03:22 :: [x86_64] #400 python-module-blessed.git 1.14.2-alt1: build start
    import sphinx_rtd_theme
ImportError: No module named sphinx_rtd_theme
The full traceback has been saved in /usr/src/tmp/sphinx-err-_FCFYz.log, if you want to report the issue to the developers.
2018-Mar-27 15:04:12 :: [x86_64] python-module-blessed.git 1.14.2-alt1: remote: build failed
2018-Mar-27 15:04:12 :: [x86_64] #400 python-module-blessed.git 1.14.2-alt1: build FAILED
    import sphinx_rtd_theme
ImportError: No module named sphinx_rtd_theme
The full traceback has been saved in /usr/src/tmp/sphinx-err-61IbYt.log, if you want to report the issue to the developers.
2018-Mar-27 15:04:14 :: [i586] python-module-blessed.git 1.14.2-alt1: remote: build failed
2018-Mar-27 15:04:14 :: [i586] #400 python-module-blessed.git 1.14.2-alt1: build FAILED
2018-Mar-27 15:04:12 :: [x86_64] build FAILED
2018-Mar-27 15:04:14 :: [i586] build FAILED
2018-Mar-27 15:04:14 :: task #203053 for sisyphus FAILED


More information about the Sisyphus-incominger mailing list