[#218110] FAILED xar.git=1.6.1-alt1
Girar Builder awaiter robot
girar-builder at altlinux.org
Wed Dec 19 15:41:35 MSK 2018
http://git.altlinux.org/tasks/218110/logs/events.1.2.log
2018-Dec-19 12:39:43 :: task #218110 for sisyphus started by viy:
#100 build 1.6.1-alt1 from /gears/x/xar.git fetched at 2018-Dec-19 09:25:14
2018-Dec-19 12:39:43 :: waiting for a shared lock on sisyphus
2018-Dec-19 12:40:24 :: acquired a shared lock on sisyphus
2018-Dec-19 12:40:25 :: [aarch64] #100 xar.git 1.6.1-alt1: build start
2018-Dec-19 12:40:25 :: [i586] #100 xar.git 1.6.1-alt1: build start
2018-Dec-19 12:40:25 :: [x86_64] #100 xar.git 1.6.1-alt1: build start
2018-Dec-19 12:41:16 :: [aarch64] #100 xar.git 1.6.1-alt1: build SKIPPED
--leaf-cert-loc= and --intermediate-cert-loc=
are accepted as synonyms for --cert-loc= for
historical reasons.
--help Show this help on stdout
-h Synonym for "--help"
-V Synonym for "--version"
--version Print xar's version number to stdout
+ ./checksums
+ . functions
./checksums: line 5: .: functions: file not found
2018-Dec-19 12:41:23 :: [i586] xar.git 1.6.1-alt1: remote: build failed
2018-Dec-19 12:41:23 :: [i586] #100 xar.git 1.6.1-alt1: build FAILED
--leaf-cert-loc= and --intermediate-cert-loc=
are accepted as synonyms for --cert-loc= for
historical reasons.
--help Show this help on stdout
-h Synonym for "--help"
-V Synonym for "--version"
--version Print xar's version number to stdout
+ ./checksums
+ . functions
./checksums: line 5: .: functions: file not found
2018-Dec-19 12:41:34 :: [x86_64] xar.git 1.6.1-alt1: remote: build failed
2018-Dec-19 12:41:34 :: [x86_64] #100 xar.git 1.6.1-alt1: build FAILED
2018-Dec-19 12:41:23 :: [i586] build FAILED
2018-Dec-19 12:41:34 :: [x86_64] build FAILED
2018-Dec-19 12:41:34 :: task #218110 for sisyphus FAILED
More information about the Sisyphus-incominger
mailing list