[#211648] FAILED freetds.git=1.00.94-alt1

Girar Builder awaiter robot girar-builder at altlinux.org
Sun Aug 19 14:15:02 MSK 2018


http://git.altlinux.org/tasks/211648/logs/events.1.1.log

2018-Aug-19 11:13:56 :: task #211648 for sisyphus started by naf:
#100 build 1.00.94-alt1 from /people/naf/packages/freetds.git fetched at 2018-Aug-19 11:13:56
2018-Aug-19 11:13:57 :: [x86_64] #100 freetds.git 1.00.94-alt1: build start
2018-Aug-19 11:13:57 :: [i586] #100 freetds.git 1.00.94-alt1: build start
2018-Aug-19 11:13:57 :: [aarch64] #100 freetds.git 1.00.94-alt1: build start
<13>Aug 19 11:14:17 rpmi: libcom_err-1.44.3-alt1 1532134713 installed
<13>Aug 19 11:14:17 rpmi: libverto-0.3.0-alt1_5 1525957716 installed
<13>Aug 19 11:14:17 rpmi: libnettle6-3.4-alt1 1511790158 installed
<13>Aug 19 11:14:17 rpmi: libtasn1-4.13-alt2 1521133848 installed
<13>Aug 19 11:14:17 rpmi: libp11-kit-0.23.9-alt5 1525798241 installed
<13>Aug 19 11:14:17 rpmi: libhogweed4-3.4-alt1 1511790158 installed
<13>Aug 19 11:14:17 rpmi: libverto-devel-0.3.0-alt1_5 1525957716 installed
<13>Aug 19 11:14:17 rpmi: libcom_err-devel-1.44.3-alt1 1532134713 installed
<13>Aug 19 11:14:17 rpmi: libltdl7-2.4.2-alt6 1533413284 installed
<13>Aug 19 11:14:17 rpmi: libunixODBC2-2.3.4-alt2 1487857369 installed
<13>Aug 19 11:14:17 rpmi: libunixODBC-devel-compat-2.3.4-alt2 1487857369 installed
<13>Aug 19 11:14:17 rpmi: libkeyutils-1.5.10-alt1 1489994069 installed
<13>Aug 19 11:14:17 rpmi: libidn2-2.0.5-alt1 1526923871 installed
<13>Aug 19 11:14:17 rpmi: libgnutls30-3.5.19-alt1 1531763324 installed
<13>Aug 19 11:14:17 rpmi: rpm-macros-alternatives-0.4.5-alt1.1 1404382149 installed
<13>Aug 19 11:14:17 rpmi: alternatives-0.4.5-alt1.1 1404382149 installed
<13>Aug 19 11:14:17 rpmi: ca-certificates-2017.11.22-alt3 1515521666 installed
<13>Aug 19 11:14:17 rpmi: ca-trust-0.1.1-alt2 1515595785 installed
<13>Aug 19 11:14:17 rpmi: p11-kit-trust-0.23.9-alt5 1525798241 installed
<13>Aug 19 11:14:17 rpmi: libcrypto10-1.0.2o-alt1 1522836697 installed
<13>Aug 19 11:14:17 rpmi: libssl10-1.0.2o-alt1 1522836697 installed
<86>Aug 19 11:14:17 groupadd[28551]: group added to /etc/group: name=_keytab, GID=499
<86>Aug 19 11:14:17 groupadd[28551]: group added to /etc/gshadow: name=_keytab
<86>Aug 19 11:14:17 groupadd[28551]: new group: name=_keytab, GID=499
<13>Aug 19 11:14:17 rpmi: libkrb5-1.16-alt1.S1 1516715375 installed
<86>Aug 19 11:14:17 groupadd[28556]: group added to /etc/group: name=sasl, GID=498
<86>Aug 19 11:14:17 groupadd[28556]: group added to /etc/gshadow: name=sasl
<86>Aug 19 11:14:17 groupadd[28556]: new group: name=sasl, GID=498
<13>Aug 19 11:14:17 rpmi: libsasl2-3-2.1.26-alt7 1479477445 installed
<13>Aug 19 11:14:17 rpmi: libldap-2.4.45-alt5 1531320652 installed
<13>Aug 19 11:14:17 rpmi: libkrb5-ldap-1.16-alt1.S1 1516715375 installed
<13>Aug 19 11:14:17 rpmi: libkrb5-devel-1.16-alt1.S1 1516715375 installed
<13>Aug 19 11:14:17 rpmi: libssl-devel-1.0.2o-alt1 1522836697 installed
<13>Aug 19 11:14:17 rpmi: libgnutls-devel-3.5.19-alt1 1531763324 installed
<13>Aug 19 11:14:17 rpmi: libunixODBC-devel-2.3.4-alt2 1487857369 installed
<13>Aug 19 11:14:17 rpmi: libreadline-devel-7.0.3-alt2 1526988921 installed
<13>Aug 19 11:14:19 rpmi: glibc-devel-static-6:2.27-alt6 1530125885 installed
<13>Aug 19 11:14:19 rpmi: doxygen-1:1.8.13-alt2.1 1520290341 installed
error: Bad file: /usr/src/in/source/freetds-0.82-alt-includes.patch: No such file or directory
    Bad file: /usr/src/in/source/freetds-0.82-alt-includes.patch: No such file or directory
Building target platforms: x86_64
Building for target x86_64


RPM build errors:
hsh-rebuild: pkg.tar: failed to create src.rpm file
2018-Aug-19 11:14:21 :: [x86_64] freetds.git 1.00.94-alt1: remote: cannot build src.rpm
2018-Aug-19 11:14:21 :: [x86_64] #100 freetds.git 1.00.94-alt1: build FAILED
<13>Aug 19 11:14:17 rpmi: libcom_err-1.44.3-alt1 1532134732 installed
<13>Aug 19 11:14:17 rpmi: libverto-0.3.0-alt1_5 1525957714 installed
<13>Aug 19 11:14:17 rpmi: libnettle6-3.4-alt1 1511790186 installed
<13>Aug 19 11:14:17 rpmi: libtasn1-4.13-alt2 1521133850 installed
<13>Aug 19 11:14:17 rpmi: libp11-kit-0.23.9-alt5 1525798298 installed
<13>Aug 19 11:14:17 rpmi: libhogweed4-3.4-alt1 1511790186 installed
<13>Aug 19 11:14:17 rpmi: libverto-devel-0.3.0-alt1_5 1525957714 installed
<13>Aug 19 11:14:17 rpmi: libcom_err-devel-1.44.3-alt1 1532134732 installed
<13>Aug 19 11:14:17 rpmi: libltdl7-2.4.2-alt6 1533413305 installed
<13>Aug 19 11:14:17 rpmi: libunixODBC2-2.3.4-alt2 1487857381 installed
<13>Aug 19 11:14:17 rpmi: libunixODBC-devel-compat-2.3.4-alt2 1487857381 installed
<13>Aug 19 11:14:17 rpmi: libkeyutils-1.5.10-alt1 1489994063 installed
<13>Aug 19 11:14:17 rpmi: libidn2-2.0.5-alt1 1526923875 installed
<13>Aug 19 11:14:17 rpmi: libgnutls30-3.5.19-alt1 1531763260 installed
<13>Aug 19 11:14:17 rpmi: rpm-macros-alternatives-0.4.5-alt1.1 1404382149 installed
<13>Aug 19 11:14:17 rpmi: alternatives-0.4.5-alt1.1 1404382149 installed
<13>Aug 19 11:14:17 rpmi: ca-certificates-2017.11.22-alt3 1515521666 installed
<13>Aug 19 11:14:17 rpmi: ca-trust-0.1.1-alt2 1515595785 installed
<13>Aug 19 11:14:17 rpmi: p11-kit-trust-0.23.9-alt5 1525798298 installed
<13>Aug 19 11:14:17 rpmi: libcrypto10-1.0.2o-alt1 1522836768 installed
<13>Aug 19 11:14:17 rpmi: libssl10-1.0.2o-alt1 1522836768 installed
<86>Aug 19 11:14:17 groupadd[11921]: group added to /etc/group: name=_keytab, GID=499
<86>Aug 19 11:14:17 groupadd[11921]: group added to /etc/gshadow: name=_keytab
<86>Aug 19 11:14:17 groupadd[11921]: new group: name=_keytab, GID=499
<13>Aug 19 11:14:17 rpmi: libkrb5-1.16-alt1.S1 1516715437 installed
<86>Aug 19 11:14:17 groupadd[11926]: group added to /etc/group: name=sasl, GID=498
<86>Aug 19 11:14:17 groupadd[11926]: group added to /etc/gshadow: name=sasl
<86>Aug 19 11:14:17 groupadd[11926]: new group: name=sasl, GID=498
<13>Aug 19 11:14:17 rpmi: libsasl2-3-2.1.26-alt7 1479477448 installed
<13>Aug 19 11:14:17 rpmi: libldap-2.4.45-alt5 1531320731 installed
<13>Aug 19 11:14:17 rpmi: libkrb5-ldap-1.16-alt1.S1 1516715437 installed
<13>Aug 19 11:14:17 rpmi: libkrb5-devel-1.16-alt1.S1 1516715437 installed
<13>Aug 19 11:14:17 rpmi: libssl-devel-1.0.2o-alt1 1522836768 installed
<13>Aug 19 11:14:17 rpmi: libgnutls-devel-3.5.19-alt1 1531763260 installed
<13>Aug 19 11:14:17 rpmi: libunixODBC-devel-2.3.4-alt2 1487857381 installed
<13>Aug 19 11:14:17 rpmi: libreadline-devel-7.0.3-alt2 1526988928 installed
<13>Aug 19 11:14:19 rpmi: glibc-devel-static-6:2.27-alt6 1530126039 installed
<13>Aug 19 11:14:20 rpmi: doxygen-1:1.8.13-alt2.1 1520290398 installed
error: Bad file: /usr/src/in/source/freetds-0.82-alt-includes.patch: No such file or directory
Building target platforms: i586
Building for target i586


RPM build errors:
    Bad file: /usr/src/in/source/freetds-0.82-alt-includes.patch: No such file or directory
hsh-rebuild: pkg.tar: failed to create src.rpm file
2018-Aug-19 11:14:21 :: [i586] freetds.git 1.00.94-alt1: remote: cannot build src.rpm
2018-Aug-19 11:14:21 :: [i586] #100 freetds.git 1.00.94-alt1: build FAILED
<13>Aug 19 11:14:55 rpmi: libcom_err-1.44.3-alt1 1532134932 installed
<13>Aug 19 11:14:55 rpmi: libverto-0.3.0-alt1_5 1525973999 installed
<13>Aug 19 11:14:55 rpmi: libnettle6-3.4-alt1 1511862005 installed
<13>Aug 19 11:14:55 rpmi: libtasn1-4.13-alt2 1521196133 installed
<13>Aug 19 11:14:55 rpmi: libp11-kit-0.23.9-alt5 1525878029 installed
<13>Aug 19 11:14:55 rpmi: libhogweed4-3.4-alt1 1511862005 installed
<13>Aug 19 11:14:55 rpmi: libverto-devel-0.3.0-alt1_5 1525973999 installed
<13>Aug 19 11:14:55 rpmi: libcom_err-devel-1.44.3-alt1 1532134932 installed
<13>Aug 19 11:14:55 rpmi: libltdl7-2.4.2-alt6 1533415032 installed
<13>Aug 19 11:14:55 rpmi: libunixODBC2-2.3.4-alt2 1488187742 installed
<13>Aug 19 11:14:55 rpmi: libunixODBC-devel-compat-2.3.4-alt2 1488187742 installed
<13>Aug 19 11:14:55 rpmi: libkeyutils-1.5.10-alt1 1490082475 installed
<13>Aug 19 11:14:55 rpmi: libidn2-2.0.5-alt1 1526974977 installed
<13>Aug 19 11:14:55 rpmi: libgnutls30-3.5.19-alt1 1531764196 installed
<13>Aug 19 11:14:55 rpmi: rpm-macros-alternatives-0.4.5-alt1.1 1404382149 installed
<13>Aug 19 11:14:55 rpmi: alternatives-0.4.5-alt1.1 1404382149 installed
<13>Aug 19 11:14:55 rpmi: ca-certificates-2017.11.22-alt3 1515521666 installed
<13>Aug 19 11:14:55 rpmi: ca-trust-0.1.1-alt2 1515595785 installed
<13>Aug 19 11:14:55 rpmi: p11-kit-trust-0.23.9-alt5 1525878029 installed
<13>Aug 19 11:14:55 rpmi: libcrypto10-1.0.2o-alt1 1522915369 installed
<13>Aug 19 11:14:55 rpmi: libssl10-1.0.2o-alt1 1522915369 installed
<86>Aug 19 11:14:55 groupadd[16631]: group added to /etc/group: name=_keytab, GID=499
<86>Aug 19 11:14:55 groupadd[16631]: group added to /etc/gshadow: name=_keytab
<86>Aug 19 11:14:55 groupadd[16631]: new group: name=_keytab, GID=499
<13>Aug 19 11:14:55 rpmi: libkrb5-1.16-alt1.S1 1516804861 installed
<86>Aug 19 11:14:56 groupadd[16636]: group added to /etc/group: name=sasl, GID=498
<86>Aug 19 11:14:56 groupadd[16636]: group added to /etc/gshadow: name=sasl
<86>Aug 19 11:14:56 groupadd[16636]: new group: name=sasl, GID=498
<13>Aug 19 11:14:56 rpmi: libsasl2-3-2.1.26-alt7 1479589313 installed
<13>Aug 19 11:14:56 rpmi: libldap-2.4.45-alt5 1531322824 installed
<13>Aug 19 11:14:56 rpmi: libkrb5-ldap-1.16-alt1.S1 1516804861 installed
<13>Aug 19 11:14:56 rpmi: libkrb5-devel-1.16-alt1.S1 1516804861 installed
<13>Aug 19 11:14:56 rpmi: libssl-devel-1.0.2o-alt1 1522915369 installed
<13>Aug 19 11:14:56 rpmi: libgnutls-devel-3.5.19-alt1 1531764196 installed
<13>Aug 19 11:14:56 rpmi: libunixODBC-devel-2.3.4-alt2 1488187742 installed
<13>Aug 19 11:14:56 rpmi: libreadline-devel-7.0.3-alt2 1526990282 installed
<13>Aug 19 11:14:57 rpmi: glibc-devel-static-6:2.27-alt6 1530127952 installed
<13>Aug 19 11:14:58 rpmi: doxygen-1:1.8.13-alt2.1 1520416526 installed
error: Bad file: /usr/src/in/source/freetds-0.82-alt-includes.patch: No such file or directory
Building target platforms: aarch64
Building for target aarch64


RPM build errors:
    Bad file: /usr/src/in/source/freetds-0.82-alt-includes.patch: No such file or directory
hsh-rebuild: pkg.tar: failed to create src.rpm file
2018-Aug-19 11:15:02 :: [aarch64] freetds.git 1.00.94-alt1: remote: cannot build src.rpm
2018-Aug-19 11:15:02 :: [aarch64] #100 freetds.git 1.00.94-alt1: build FAILED
2018-Aug-19 11:14:21 :: [x86_64] build FAILED
2018-Aug-19 11:14:21 :: [i586] build FAILED
2018-Aug-19 11:15:02 :: [aarch64] build FAILED
2018-Aug-19 11:15:02 :: task #211648 for sisyphus FAILED


More information about the Sisyphus-incominger mailing list