[#169285] FAILED (try 14) rpm-build-ruby.git=0.1.4-alt1 ruby.git=2.3.1-alt1 ...

Girar Builder awaiter robot girar-builder at altlinux.org
Tue Sep 13 15:44:50 MSK 2016


http://git.altlinux.org/tasks/169285/logs/events.14.1.log

2016-Sep-13 12:24:11 :: test-only shared task #169285 for sisyphus resumed by nbr:
#40 build 0.1.4-alt1 from /people/imz/packages/rpm-build-ruby.git
#100 removed
#200 removed
#300 removed
#320 removed
#330 removed
#340 build 2.3.1-alt1 from /people/nbr/packages/ruby.git
#400 build 0.99-alt15.beta19.1 from /people/glebfm/packages/libcaca.git
#420 build 3.2.1-alt1 from /people/cas/packages/ruby-test-unit.git
#440 build 3.4.1-alt6 from /people/cas/packages/ruby-tool-setup.git
#500 build 1.2.0.1-alt2 from /people/cas/packages/ruby-eventmachine.git
#600 build 1.9.14-alt1 from /people/cas/packages/ruby-ffi.git
#700 removed
#1000 build 1.2.1-alt2 from /people/cas/packages/yajl-ruby.git
#1100 build 2.3.0-alt1 from /people/cas/packages/ruby-ffi-yajl.git
#1200 removed
#1300 removed
#1400 build 0.1.0-alt2 from /people/cas/packages/ruby-idn.git
#1500 build 0.6.0-alt2 from /people/cas/packages/ruby-http_parser.rb.git
#1600 build 2.0.1-alt1 from /people/cas/packages/ruby-json-pure.git
#1700 build 0.4.4-alt2 from /people/cas/packages/ruby-mysql2.git
#2000 build 2.17.4-alt1 from /people/cas/packages/ruby-oj.git
#2100 removed
#2200 removed
#2300 build 2.9.0-alt1 from /people/cas/packages/libxml-ruby.git
#2400 build 2.9.0-alt1 from /people/cas/packages/mysql-ruby.git
2016-Sep-13 12:24:29 :: created build repo
2016-Sep-13 12:24:30 :: [x86_64] #40 rpm-build-ruby.git 0.1.4-alt1: build start
2016-Sep-13 12:24:30 :: [i586] #40 rpm-build-ruby.git 0.1.4-alt1: build start
2016-Sep-13 12:25:17 :: [i586] #40 rpm-build-ruby.git 0.1.4-alt1: build OK
2016-Sep-13 12:25:18 :: [i586] #340 ruby.git 2.3.1-alt1: build start
2016-Sep-13 12:25:18 :: [x86_64] #40 rpm-build-ruby.git 0.1.4-alt1: build OK
2016-Sep-13 12:25:18 :: [x86_64] #340 ruby.git 2.3.1-alt1: build start
2016-Sep-13 12:38:21 :: [x86_64] #340 ruby.git 2.3.1-alt1: build OK
2016-Sep-13 12:38:21 :: [x86_64] #400 libcaca.git 0.99-alt15.beta19.1: build start
2016-Sep-13 12:39:58 :: [i586] #340 ruby.git 2.3.1-alt1: build OK
2016-Sep-13 12:39:58 :: [i586] #400 libcaca.git 0.99-alt15.beta19.1: build start
2016-Sep-13 12:42:21 :: [x86_64] #400 libcaca.git 0.99-alt15.beta19.1: build OK
2016-Sep-13 12:42:21 :: [x86_64] #420 ruby-test-unit.git 3.2.1-alt1: build start
+ umask 022
+ /bin/mkdir -p /usr/src/RPM/BUILD
+ cd /usr/src/RPM/BUILD
+ cd test-unit-3.2.1
+ /usr/bin/ruby -rvendor-specific setup.rb config
setup.rb:283: warning: key "bin-dir" is duplicated and overwritten on line 284
setup.rb:787:in `load_rbconfig': uninitialized constant Config (NameError)
Did you mean?  RbConfig
	from setup.rb:768:in `invoke'
	from setup.rb:1578:in `<main>'
2016-Sep-13 12:42:52 :: [x86_64] ruby-test-unit.git 3.2.1-alt1: remote: build failed
2016-Sep-13 12:42:52 :: [x86_64] #420 ruby-test-unit.git 3.2.1-alt1: build FAILED
2016-Sep-13 12:44:18 :: [i586] #400 libcaca.git 0.99-alt15.beta19.1: build OK
2016-Sep-13 12:44:18 :: [i586] #420 ruby-test-unit.git 3.2.1-alt1: build start
+ umask 022
+ /bin/mkdir -p /usr/src/RPM/BUILD
+ cd /usr/src/RPM/BUILD
+ cd test-unit-3.2.1
+ /usr/bin/ruby -rvendor-specific setup.rb config
setup.rb:283: warning: key "bin-dir" is duplicated and overwritten on line 284
setup.rb:787:in `load_rbconfig': uninitialized constant Config (NameError)
Did you mean?  RbConfig
	from setup.rb:768:in `invoke'
	from setup.rb:1578:in `<main>'
2016-Sep-13 12:44:49 :: [i586] ruby-test-unit.git 3.2.1-alt1: remote: build failed
2016-Sep-13 12:44:49 :: [i586] #420 ruby-test-unit.git 3.2.1-alt1: build FAILED
2016-Sep-13 12:42:52 :: [x86_64] build FAILED
2016-Sep-13 12:44:49 :: [i586] build FAILED
2016-Sep-13 12:44:49 :: task #169285 for sisyphus FAILED


More information about the Sisyphus-incominger mailing list