[#175221] FAILED srpm=grizzly-2.3.24-alt1_2jpp8.src.rpm

Girar Builder awaiter robot girar-builder at altlinux.org
Tue Dec 20 11:04:32 MSK 2016


http://git.altlinux.org/tasks/175221/logs/events.1.1.log

2016-Dec-20 07:46:18 :: task #175221 for sisyphus started by viy:
#100 build grizzly-2.3.24-alt1_2jpp8.src.rpm
2016-Dec-20 07:46:18 :: waiting for a shared lock on sisyphus
2016-Dec-20 07:46:44 :: acquired a shared lock on sisyphus
2016-Dec-20 07:46:44 :: [i586] #100 grizzly-2.3.24-alt1_2jpp8.src.rpm: build start
2016-Dec-20 07:46:44 :: [x86_64] #100 grizzly-2.3.24-alt1_2jpp8.src.rpm: build start
Tests run: 16, Failures: 0, Errors: 3, Skipped: 0, Time elapsed: 0.395 sec <<< FAILURE! - in org.glassfish.grizzly.memory.ThreadLocalMemoryManagerTest
testSimpleAllocateHistory[1](org.glassfish.grizzly.memory.ThreadLocalMemoryManagerTest)  Time elapsed: 0.014 sec  <<< ERROR!
java.lang.OutOfMemoryError: unable to create new native thread
	at org.glassfish.grizzly.memory.ThreadLocalMemoryManagerTest.testInWorkerThread(ThreadLocalMemoryManagerTest.java:398)
	at org.glassfish.grizzly.memory.ThreadLocalMemoryManagerTest.testSimpleAllocateHistory(ThreadLocalMemoryManagerTest.java:199)
testDispose[1](org.glassfish.grizzly.memory.ThreadLocalMemoryManagerTest)  Time elapsed: 0.001 sec  <<< ERROR!
java.lang.OutOfMemoryError: unable to create new native thread
	at org.glassfish.grizzly.memory.ThreadLocalMemoryManagerTest.testInWorkerThread(ThreadLocalMemoryManagerTest.java:398)
	at org.glassfish.grizzly.memory.ThreadLocalMemoryManagerTest.testDispose(ThreadLocalMemoryManagerTest.java:137)
testTrimAllocateHistory[1](org.glassfish.grizzly.memory.ThreadLocalMemoryManagerTest)  Time elapsed: 0.001 sec  <<< ERROR!
java.lang.OutOfMemoryError: unable to create new native thread
	at org.glassfish.grizzly.memory.ThreadLocalMemoryManagerTest.testInWorkerThread(ThreadLocalMemoryManagerTest.java:398)
--
Results :
Tests in error: 
  SSLTest.testCompletionHandlerNotification:386 ? Execution java.lang.IllegalSta...
2016-Dec-20 07:53:55 :: [x86_64] grizzly-2.3.24-alt1_2jpp8.src.rpm: remote: build failed
2016-Dec-20 07:53:55 :: [x86_64] #100 grizzly-2.3.24-alt1_2jpp8.src.rpm: build FAILED
2016-Dec-20 08:04:31 :: [i586] #100 grizzly-2.3.24-alt1_2jpp8.src.rpm: build OK
2016-Dec-20 07:53:55 :: [x86_64] build FAILED
2016-Dec-20 08:04:31 :: task #175221 for sisyphus FAILED


More information about the Sisyphus-incominger mailing list