[#126997] FAILED srpm=jboss-as-7.1.1-alt4_6jpp7.src.rpm

Girar Builder awaiter robot girar-builder at altlinux.org
Thu Aug 7 20:16:01 MSK 2014


http://git.altlinux.org/tasks/126997/logs/events.1.1.log

2014-Aug-07 16:11:40 :: task #126997 for sisyphus started by viy:
#100 build jboss-as-7.1.1-alt4_6jpp7.src.rpm
2014-Aug-07 16:11:40 :: waiting for a shared lock on sisyphus
2014-Aug-07 16:12:08 :: acquired a shared lock on sisyphus
2014-Aug-07 16:12:08 :: [i586] #100 jboss-as-7.1.1-alt4_6jpp7.src.rpm: build start
2014-Aug-07 16:12:08 :: [x86_64] #100 jboss-as-7.1.1-alt4_6jpp7.src.rpm: build start
[ERROR] For more information about the errors and possible solutions, please read the following articles:
[ERROR] [Help 1] http://cwiki.apache.org/confluence/display/MAVEN/DependencyResolutionException
[ERROR] 
[ERROR] After correcting the problems, you can resume the build with the command
[ERROR]   mvn <goals> -rf :jboss-as-transactions
error: Bad exit status from /usr/src/tmp/rpm-tmp.80608 (%build)
RPM build errors:
    Macro %name not found
    Macro %version not found
    Macro %2 not found
2014-Aug-07 16:15:55 :: [x86_64] jboss-as-7.1.1-alt4_6jpp7.src.rpm: remote: build failed
2014-Aug-07 16:15:55 :: [x86_64] #100 jboss-as-7.1.1-alt4_6jpp7.src.rpm: build FAILED
[ERROR] For more information about the errors and possible solutions, please read the following articles:
[ERROR] [Help 1] http://cwiki.apache.org/confluence/display/MAVEN/DependencyResolutionException
[ERROR] 
[ERROR] After correcting the problems, you can resume the build with the command
[ERROR]   mvn <goals> -rf :jboss-as-transactions
error: Bad exit status from /usr/src/tmp/rpm-tmp.91791 (%build)
RPM build errors:
    Macro %name not found
    Macro %version not found
    Macro %2 not found
2014-Aug-07 16:16:01 :: [i586] jboss-as-7.1.1-alt4_6jpp7.src.rpm: remote: build failed
2014-Aug-07 16:16:01 :: [i586] #100 jboss-as-7.1.1-alt4_6jpp7.src.rpm: build FAILED
2014-Aug-07 16:15:55 :: [x86_64] build FAILED
2014-Aug-07 16:16:01 :: [i586] build FAILED
2014-Aug-07 16:16:01 :: task #126997 for sisyphus FAILED


More information about the Sisyphus-incominger mailing list