[#89971] FAILED (try 40) python3.git=3.3.0-alt1 boost.git=1.53.0-alt3 ...

Girar Builder robot girar-builder at altlinux.org
Thu Feb 21 18:19:39 MSK 2013


http://git.altlinux.org/tasks/89971/logs/events.40.1.log

2013-Feb-21 12:00:03 :: test-only shared task #89971 for sisyphus resumed by solo:
#100 removed
#101 removed
#102 removed
#103 build 3.3.0-alt1 from /people/solo/packages/python3.git
#104 removed
#110 removed
#120 removed
#140 removed
#200 removed
#220 removed
#240 removed
#300 removed
#400 build 1.53.0-alt3 from /people/iv/packages/boost.git
#500 build 1.4-alt3.git20120704 from /gears/e/engrid.git
#504 build 0.6.35-alt1 from /people/solo/packages/python-module-distribute.git
#506 build 2.7-alt1.git20120916 from /people/solo/packages/python-module-jinja2.git
#510 removed
#514 build 1.6-alt1 from /gears/p/python-module-Pygments.git
#516 build 0.11-alt1.svn20130117 from /gears/p/python-module-docutils.git
#517 removed
#520 removed
#540 removed
#542 build 3.6.1-alt2.a0.hg20130202 from /people/solo/packages/python-module-coverage.git
#544 removed
#545 build 1.2.1-alt1.git8fa890fa from /people/solo/packages/python-module-nose.git
#546 removed
#547 removed
#550 removed
#554 build 2.3.3.20130205-alt2 from /gears/p/python-module-objects.inv.git
#560 build 1.1.3-alt4 from /gears/p/python-module-sphinx.git
#600 build 1.4.13-alt1.dev3.hg20130127 from /gears/p/py.git
#620 build 0.7.10-alt1 from /gears/p/python-module-SQLAlchemy.git
#630 build 2.4.1-alt1 from /people/solo/packages/python-module-whoosh.git
#634 build py3-1.1.2-alt1.1 from /people/solo/packages/shiboken-py3.git
#640 removed
#700 build py3-1.1.2-alt1 from /gears/p/pyside-qt4-py3.git
#1000 build 0.2.14-alt2.git20120427 from /gears/p/pyside-tools-py3.git
#1100 build 2.0-alt1 from /gears/p/python3-module-dateutil.git
#1140 build 1.1.1-alt3.1 from /people/solo/packages/python3-module-dbus.git
#1160 removed
#1200 removed
#1300 build 1.6.1-alt1 from /gears/p/python3-module-jsonlib.git
#1400 build 1.2.3-alt1.git20111005 from /gears/p/python3-module-MySQLdb.git
#1500 removed
#1520 removed
#1530 removed
#1534 build 1.5.7-alt1 from /people/solo/packages/python-module-pyparsing.git
#1540 removed
#1560 removed
#1570 build 2.0.0-alt1 from /people/solo/packages/python-module-pyparsing.git
#1600 build 1.0.15-alt1.hg20110706 from /gears/p/python3-module-pydot.git
#1700 build 20110416-alt1 from /gears/p/python3-module-rfc822py3.git
#2000 build 1.0.0-alt1.hg20100824 from /gears/p/python3-module-sgmllib.git
#2100 build 0.1.2-alt1 from /gears/p/python3-module-xlwt3.git
#2200 build 1.2-alt2.hg20110331 from /gears/p/python-module-argparse.git
#2300 build 1.6.4-alt1 from /gears/p/python-module-beaker.git
#2400 build 2.11-alt1.git20130114 from /gears/p/python-module-chameleon.core.git
#2440 build 2.1.1-alt1 from /gears/p/python-module-markdown.git
#2500 build 2.4.4-alt1 from /gears/p/python-module-cheetah.git
#2600 build 0.1-alt2 from /gears/p/python-module-CleverCSS.git
#2700 build 0.6.4-alt5 from /gears/p/python-module-cmd2.git
#3000 build 2012.1.2-alt1.git20120607 from /gears/p/python-module-codepy.git
#3100 build 1.0.8-alt2.git20121128 from /gears/p/python-module-colormath.git
#3200 build 1.4.1-alt1 from /gears/p/python-module-cryptacular.git
#3300 build 1.1.5-alt3 from /gears/p/python-module-cvxopt.git
#3320 build 2.0.0-alt7.git20121009 from /gears/p/python-module-numpy.git
#3340 removed
#3344 build 0.9.6-alt1 from /people/solo/packages/python-module-babel.git
#3350 build 1.2-alt3.alpha1 from /people/solo/packages/python-module-pyglet.git
#3360 build 0.7.2-alt1.git20130210 from /gears/s/sympy.git
#3364 build 0.15-alt1 from /gears/p/python-module-markupsafe.git
#3370 build 0.7.3-alt1 from /people/solo/packages/python-module-mako.git
#3374 build 0.12.0-alt2.git20121009 from /gears/p/python-module-scipy.git
#3400 build 0.1-alt1.svn20130211 from /gears/p/python-module-cvxpy.git
#3500 build 3.0.3-alt1 from /gears/p/python-module-DateTime.git
#3600 build 3.4.0-alt1 from /gears/p/python-module-decorator.git
#3700 build 0.3-alt1 from /gears/p/python-module-dobbin.git
#4000 build 0.16-alt1 from /gears/p/python-module-fanstatic.git
#4100 build 1.0.3-alt1.hg20120223 from /gears/p/python-module-flup.git
#4200 build 0.9.2-alt1 from /gears/p/python-module-fastimport.git
#4300 build 0.6-alt2 from /gears/p/python-module-genshi.git
#4400 build 0.3.6-alt1.git20130201 from /gears/p/python-module-gevent-socketio.git
#4500 build 0.3.6-alt1.hg20120723 from /gears/p/python-module-gevent-websocket.git
#4600 build 0.95-alt3 from /gears/p/python-module-html5lib.git
#4700 build 0.1.1-alt2.svn20090926 from /gears/p/python-module-httpencode.git
#5000 build 0.7.7-alt1 from /gears/p/python-module-httplib2.git
#5100 build 1.1.1-alt2 from /gears/p/python-module-interlude.git
#5200 removed
#5300 build 0.5.0-alt1.hg20120329 from /gears/p/python-module-logilab-constraint.git
#5400 build py3-1.10.1-alt3.git20120819.1 from /people/solo/packages/python3-module-pycairo.git
#5500 removed
#5600 removed
#5700 build 1.3.0-alt3.git20121010 from /gears/p/python-module-matplotlib.git
#6000 build 1.3-alt2.hg20120510 from /gears/p/python-module-mpi4py.git
#6100 build 0.17-alt2 from /gears/p/python-module-mpmath.git
#6200 build 1.8-alt1.hg20120708.00 from /gears/p/python-module-networkx.git
#6300 removed
#6400 build 0.13-alt1.1 from /gears/p/python-module-OpenSSL.git
#6500 build 1.7.5.1-alt1.hg20120305 from /gears/p/python-module-paste.git
#6600 build 1.5.1-alt1.hg20120916 from /gears/p/python-module-PasteDeploy.git
#6700 build 1.7.5-alt1.hg20120208 from /gears/p/python-module-PasteScript.git
2013-Feb-21 12:00:16 :: created build repo
2013-Feb-21 12:00:18 :: [i586] #103 python3.git 3.3.0-alt1: build start
2013-Feb-21 12:00:18 :: [x86_64] #103 python3.git 3.3.0-alt1: build start
2013-Feb-21 12:00:51 :: [x86_64] python3.git 3.3.0-alt1: remote: no need to rebuild
2013-Feb-21 12:00:52 :: [x86_64] #103 python3.git 3.3.0-alt1: build OK
2013-Feb-21 12:00:52 :: [x86_64] #400 boost.git 1.53.0-alt3: build start
2013-Feb-21 12:00:52 :: [i586] python3.git 3.3.0-alt1: remote: no need to rebuild
2013-Feb-21 12:00:53 :: [i586] #103 python3.git 3.3.0-alt1: build OK
2013-Feb-21 12:00:53 :: [i586] #400 boost.git 1.53.0-alt3: build start
2013-Feb-21 12:01:23 :: [x86_64] boost.git 1.53.0-alt3: remote: no need to rebuild
2013-Feb-21 12:01:23 :: [i586] boost.git 1.53.0-alt3: remote: no need to rebuild
2013-Feb-21 12:01:28 :: [x86_64] #400 boost.git 1.53.0-alt3: build OK
2013-Feb-21 12:01:28 :: [x86_64] #500 engrid.git 1.4-alt3.git20120704: build start
2013-Feb-21 12:01:29 :: [i586] #400 boost.git 1.53.0-alt3: build OK
2013-Feb-21 12:01:29 :: [i586] #500 engrid.git 1.4-alt3.git20120704: build start
2013-Feb-21 12:01:56 :: [i586] engrid.git 1.4-alt3.git20120704: remote: no need to rebuild
2013-Feb-21 12:01:56 :: [x86_64] engrid.git 1.4-alt3.git20120704: remote: no need to rebuild
2013-Feb-21 12:01:56 :: [i586] #500 engrid.git 1.4-alt3.git20120704: build OK
2013-Feb-21 12:01:56 :: [i586] #504 python-module-distribute.git 0.6.35-alt1: build start
2013-Feb-21 12:01:56 :: [x86_64] #500 engrid.git 1.4-alt3.git20120704: build OK
2013-Feb-21 12:01:56 :: [x86_64] #504 python-module-distribute.git 0.6.35-alt1: build start
2013-Feb-21 12:03:07 :: [x86_64] #504 python-module-distribute.git 0.6.35-alt1: build OK
2013-Feb-21 12:03:07 :: [x86_64] #506 python-module-jinja2.git 2.7-alt1.git20120916: build start
2013-Feb-21 12:03:11 :: [i586] #504 python-module-distribute.git 0.6.35-alt1: build OK
2013-Feb-21 12:03:11 :: [i586] #506 python-module-jinja2.git 2.7-alt1.git20120916: build start
2013-Feb-21 12:04:29 :: [x86_64] #506 python-module-jinja2.git 2.7-alt1.git20120916: build OK
2013-Feb-21 12:04:29 :: [x86_64] #514 python-module-Pygments.git 1.6-alt1: build start
2013-Feb-21 12:04:39 :: [i586] #506 python-module-jinja2.git 2.7-alt1.git20120916: build OK
2013-Feb-21 12:04:39 :: [i586] #514 python-module-Pygments.git 1.6-alt1: build start
2013-Feb-21 12:06:52 :: [x86_64] #514 python-module-Pygments.git 1.6-alt1: build OK
2013-Feb-21 12:06:52 :: [x86_64] #516 python-module-docutils.git 0.11-alt1.svn20130117: build start
2013-Feb-21 12:07:05 :: [x86_64] python-module-docutils.git 0.11-alt1.svn20130117: remote: no need to rebuild
2013-Feb-21 12:07:05 :: [x86_64] #516 python-module-docutils.git 0.11-alt1.svn20130117: build OK
2013-Feb-21 12:07:05 :: [x86_64] #542 python-module-coverage.git 3.6.1-alt2.a0.hg20130202: build start
2013-Feb-21 12:07:13 :: [i586] #514 python-module-Pygments.git 1.6-alt1: build OK
2013-Feb-21 12:07:13 :: [i586] #516 python-module-docutils.git 0.11-alt1.svn20130117: build start
2013-Feb-21 12:07:26 :: [i586] python-module-docutils.git 0.11-alt1.svn20130117: remote: no need to rebuild
2013-Feb-21 12:07:26 :: [i586] #516 python-module-docutils.git 0.11-alt1.svn20130117: build OK
2013-Feb-21 12:07:26 :: [i586] #542 python-module-coverage.git 3.6.1-alt2.a0.hg20130202: build start
2013-Feb-21 12:08:11 :: [x86_64] #542 python-module-coverage.git 3.6.1-alt2.a0.hg20130202: build OK
2013-Feb-21 12:08:11 :: [x86_64] #545 python-module-nose.git 1.2.1-alt1.git8fa890fa: build start
2013-Feb-21 12:08:35 :: [i586] #542 python-module-coverage.git 3.6.1-alt2.a0.hg20130202: build OK
2013-Feb-21 12:08:35 :: [i586] #545 python-module-nose.git 1.2.1-alt1.git8fa890fa: build start
2013-Feb-21 12:10:18 :: [x86_64] #545 python-module-nose.git 1.2.1-alt1.git8fa890fa: build OK
2013-Feb-21 12:10:18 :: [x86_64] #554 python-module-objects.inv.git 2.3.3.20130205-alt2: build start
2013-Feb-21 12:10:30 :: [x86_64] python-module-objects.inv.git 2.3.3.20130205-alt2: remote: no need to rebuild
2013-Feb-21 12:10:30 :: [x86_64] #554 python-module-objects.inv.git 2.3.3.20130205-alt2: build OK
2013-Feb-21 12:10:30 :: [x86_64] #560 python-module-sphinx.git 1.1.3-alt4: build start
2013-Feb-21 12:10:42 :: [i586] #545 python-module-nose.git 1.2.1-alt1.git8fa890fa: build OK
2013-Feb-21 12:10:42 :: [i586] #554 python-module-objects.inv.git 2.3.3.20130205-alt2: build start
2013-Feb-21 12:10:55 :: [i586] python-module-objects.inv.git 2.3.3.20130205-alt2: remote: no need to rebuild
2013-Feb-21 12:10:55 :: [i586] #554 python-module-objects.inv.git 2.3.3.20130205-alt2: build OK
2013-Feb-21 12:10:55 :: [i586] #560 python-module-sphinx.git 1.1.3-alt4: build start
2013-Feb-21 12:16:39 :: [x86_64] #560 python-module-sphinx.git 1.1.3-alt4: build OK
2013-Feb-21 12:16:39 :: [x86_64] #600 py.git 1.4.13-alt1.dev3.hg20130127: build start
2013-Feb-21 12:17:20 :: [i586] #560 python-module-sphinx.git 1.1.3-alt4: build OK
2013-Feb-21 12:17:20 :: [i586] #600 py.git 1.4.13-alt1.dev3.hg20130127: build start
2013-Feb-21 12:17:33 :: [x86_64] #600 py.git 1.4.13-alt1.dev3.hg20130127: build OK
2013-Feb-21 12:17:33 :: [x86_64] #620 python-module-SQLAlchemy.git 0.7.10-alt1: build start
2013-Feb-21 12:18:19 :: [i586] #600 py.git 1.4.13-alt1.dev3.hg20130127: build OK
2013-Feb-21 12:18:19 :: [i586] #620 python-module-SQLAlchemy.git 0.7.10-alt1: build start
2013-Feb-21 12:19:39 :: [x86_64] #620 python-module-SQLAlchemy.git 0.7.10-alt1: build OK
2013-Feb-21 12:19:39 :: [x86_64] #630 python-module-whoosh.git 2.4.1-alt1: build start
2013-Feb-21 12:20:35 :: [i586] #620 python-module-SQLAlchemy.git 0.7.10-alt1: build OK
2013-Feb-21 12:20:35 :: [i586] #630 python-module-whoosh.git 2.4.1-alt1: build start
2013-Feb-21 12:21:17 :: [x86_64] #630 python-module-whoosh.git 2.4.1-alt1: build OK
2013-Feb-21 12:21:17 :: [x86_64] #634 shiboken-py3.git py3-1.1.2-alt1.1: build start
2013-Feb-21 12:22:20 :: [i586] #630 python-module-whoosh.git 2.4.1-alt1: build OK
2013-Feb-21 12:22:20 :: [i586] #634 shiboken-py3.git py3-1.1.2-alt1.1: build start
2013-Feb-21 12:28:34 :: [x86_64] #634 shiboken-py3.git py3-1.1.2-alt1.1: build OK
2013-Feb-21 12:28:34 :: [x86_64] #700 pyside-qt4-py3.git py3-1.1.2-alt1: build start
2013-Feb-21 12:30:18 :: [i586] #634 shiboken-py3.git py3-1.1.2-alt1.1: build OK
2013-Feb-21 12:30:18 :: [i586] #700 pyside-qt4-py3.git py3-1.1.2-alt1: build start
2013-Feb-21 13:21:38 :: [x86_64] #700 pyside-qt4-py3.git py3-1.1.2-alt1: build OK
2013-Feb-21 13:21:38 :: [x86_64] #1000 pyside-tools-py3.git 0.2.14-alt2.git20120427: build start
2013-Feb-21 13:22:54 :: [x86_64] #1000 pyside-tools-py3.git 0.2.14-alt2.git20120427: build OK
2013-Feb-21 13:22:54 :: [x86_64] #1100 python3-module-dateutil.git 2.0-alt1: build start
2013-Feb-21 13:23:27 :: [x86_64] #1100 python3-module-dateutil.git 2.0-alt1: build OK
2013-Feb-21 13:23:27 :: [x86_64] #1140 python3-module-dbus.git 1.1.1-alt3.1: build start
2013-Feb-21 13:23:40 :: [x86_64] python3-module-dbus.git 1.1.1-alt3.1: remote: no need to rebuild
2013-Feb-21 13:23:40 :: [x86_64] #1140 python3-module-dbus.git 1.1.1-alt3.1: build OK
2013-Feb-21 13:23:40 :: [x86_64] #1300 python3-module-jsonlib.git 1.6.1-alt1: build start
2013-Feb-21 13:24:17 :: [x86_64] #1300 python3-module-jsonlib.git 1.6.1-alt1: build OK
2013-Feb-21 13:24:17 :: [x86_64] #1400 python3-module-MySQLdb.git 1.2.3-alt1.git20111005: build start
2013-Feb-21 13:24:55 :: [x86_64] #1400 python3-module-MySQLdb.git 1.2.3-alt1.git20111005: build OK
2013-Feb-21 13:24:55 :: [x86_64] #1534 python-module-pyparsing.git 1.5.7-alt1: build start
2013-Feb-21 13:25:07 :: [x86_64] python-module-pyparsing.git 1.5.7-alt1: remote: no need to rebuild
2013-Feb-21 13:25:07 :: [x86_64] #1534 python-module-pyparsing.git 1.5.7-alt1: build OK
2013-Feb-21 13:25:07 :: [x86_64] #1570 python-module-pyparsing.git 2.0.0-alt1: build start
2013-Feb-21 13:25:20 :: [x86_64] python-module-pyparsing.git 2.0.0-alt1: remote: no need to rebuild
2013-Feb-21 13:25:20 :: [x86_64] #1570 python-module-pyparsing.git 2.0.0-alt1: build OK
2013-Feb-21 13:25:20 :: [x86_64] #1600 python3-module-pydot.git 1.0.15-alt1.hg20110706: build start
2013-Feb-21 13:25:33 :: [x86_64] python3-module-pydot.git 1.0.15-alt1.hg20110706: remote: no need to rebuild
2013-Feb-21 13:25:33 :: [x86_64] #1600 python3-module-pydot.git 1.0.15-alt1.hg20110706: build OK
2013-Feb-21 13:25:33 :: [x86_64] #1700 python3-module-rfc822py3.git 20110416-alt1: build start
2013-Feb-21 13:25:46 :: [x86_64] python3-module-rfc822py3.git 20110416-alt1: remote: no need to rebuild
2013-Feb-21 13:25:46 :: [x86_64] #1700 python3-module-rfc822py3.git 20110416-alt1: build OK
2013-Feb-21 13:25:46 :: [x86_64] #2000 python3-module-sgmllib.git 1.0.0-alt1.hg20100824: build start
2013-Feb-21 13:26:18 :: [x86_64] #2000 python3-module-sgmllib.git 1.0.0-alt1.hg20100824: build OK
2013-Feb-21 13:26:18 :: [x86_64] #2100 python3-module-xlwt3.git 0.1.2-alt1: build start
2013-Feb-21 13:26:30 :: [x86_64] python3-module-xlwt3.git 0.1.2-alt1: remote: no need to rebuild
2013-Feb-21 13:26:30 :: [x86_64] #2100 python3-module-xlwt3.git 0.1.2-alt1: build OK
2013-Feb-21 13:26:30 :: [x86_64] #2200 python-module-argparse.git 1.2-alt2.hg20110331: build start
2013-Feb-21 13:26:31 :: [i586] #700 pyside-qt4-py3.git py3-1.1.2-alt1: build OK
2013-Feb-21 13:26:31 :: [i586] #1000 pyside-tools-py3.git 0.2.14-alt2.git20120427: build start
2013-Feb-21 13:27:18 :: [x86_64] #2200 python-module-argparse.git 1.2-alt2.hg20110331: build OK
2013-Feb-21 13:27:18 :: [x86_64] #2300 python-module-beaker.git 1.6.4-alt1: build start
2013-Feb-21 13:27:48 :: [i586] #1000 pyside-tools-py3.git 0.2.14-alt2.git20120427: build OK
2013-Feb-21 13:27:48 :: [i586] #1100 python3-module-dateutil.git 2.0-alt1: build start
2013-Feb-21 13:28:00 :: [x86_64] #2300 python-module-beaker.git 1.6.4-alt1: build OK
2013-Feb-21 13:28:00 :: [x86_64] #2400 python-module-chameleon.core.git 2.11-alt1.git20130114: build start
2013-Feb-21 13:28:21 :: [i586] #1100 python3-module-dateutil.git 2.0-alt1: build OK
2013-Feb-21 13:28:21 :: [i586] #1140 python3-module-dbus.git 1.1.1-alt3.1: build start
2013-Feb-21 13:28:34 :: [i586] python3-module-dbus.git 1.1.1-alt3.1: remote: no need to rebuild
2013-Feb-21 13:28:34 :: [i586] #1140 python3-module-dbus.git 1.1.1-alt3.1: build OK
2013-Feb-21 13:28:34 :: [i586] #1300 python3-module-jsonlib.git 1.6.1-alt1: build start
2013-Feb-21 13:29:11 :: [i586] #1300 python3-module-jsonlib.git 1.6.1-alt1: build OK
2013-Feb-21 13:29:11 :: [i586] #1400 python3-module-MySQLdb.git 1.2.3-alt1.git20111005: build start
2013-Feb-21 13:29:28 :: [x86_64] #2400 python-module-chameleon.core.git 2.11-alt1.git20130114: build OK
2013-Feb-21 13:29:28 :: [x86_64] #2440 python-module-markdown.git 2.1.1-alt1: build start
2013-Feb-21 13:29:40 :: [x86_64] python-module-markdown.git 2.1.1-alt1: remote: no need to rebuild
2013-Feb-21 13:29:41 :: [x86_64] #2440 python-module-markdown.git 2.1.1-alt1: build OK
2013-Feb-21 13:29:41 :: [x86_64] #2500 python-module-cheetah.git 2.4.4-alt1: build start
2013-Feb-21 13:29:49 :: [i586] #1400 python3-module-MySQLdb.git 1.2.3-alt1.git20111005: build OK
2013-Feb-21 13:29:49 :: [i586] #1534 python-module-pyparsing.git 1.5.7-alt1: build start
2013-Feb-21 13:30:01 :: [i586] python-module-pyparsing.git 1.5.7-alt1: remote: no need to rebuild
2013-Feb-21 13:30:01 :: [i586] #1534 python-module-pyparsing.git 1.5.7-alt1: build OK
2013-Feb-21 13:30:01 :: [i586] #1570 python-module-pyparsing.git 2.0.0-alt1: build start
2013-Feb-21 13:30:14 :: [i586] python-module-pyparsing.git 2.0.0-alt1: remote: no need to rebuild
2013-Feb-21 13:30:14 :: [i586] #1570 python-module-pyparsing.git 2.0.0-alt1: build OK
2013-Feb-21 13:30:14 :: [i586] #1600 python3-module-pydot.git 1.0.15-alt1.hg20110706: build start
2013-Feb-21 13:30:27 :: [i586] python3-module-pydot.git 1.0.15-alt1.hg20110706: remote: no need to rebuild
2013-Feb-21 13:30:27 :: [i586] #1600 python3-module-pydot.git 1.0.15-alt1.hg20110706: build OK
2013-Feb-21 13:30:27 :: [i586] #1700 python3-module-rfc822py3.git 20110416-alt1: build start
2013-Feb-21 13:30:39 :: [i586] python3-module-rfc822py3.git 20110416-alt1: remote: no need to rebuild
2013-Feb-21 13:30:39 :: [i586] #1700 python3-module-rfc822py3.git 20110416-alt1: build OK
2013-Feb-21 13:30:39 :: [i586] #2000 python3-module-sgmllib.git 1.0.0-alt1.hg20100824: build start
2013-Feb-21 13:31:11 :: [i586] #2000 python3-module-sgmllib.git 1.0.0-alt1.hg20100824: build OK
2013-Feb-21 13:31:12 :: [i586] #2100 python3-module-xlwt3.git 0.1.2-alt1: build start
2013-Feb-21 13:31:24 :: [i586] python3-module-xlwt3.git 0.1.2-alt1: remote: no need to rebuild
2013-Feb-21 13:31:24 :: [i586] #2100 python3-module-xlwt3.git 0.1.2-alt1: build OK
2013-Feb-21 13:31:24 :: [i586] #2200 python-module-argparse.git 1.2-alt2.hg20110331: build start
2013-Feb-21 13:32:14 :: [i586] #2200 python-module-argparse.git 1.2-alt2.hg20110331: build OK
2013-Feb-21 13:32:14 :: [i586] #2300 python-module-beaker.git 1.6.4-alt1: build start
2013-Feb-21 13:32:57 :: [i586] #2300 python-module-beaker.git 1.6.4-alt1: build OK
2013-Feb-21 13:32:57 :: [i586] #2400 python-module-chameleon.core.git 2.11-alt1.git20130114: build start
2013-Feb-21 13:33:02 :: [x86_64] #2500 python-module-cheetah.git 2.4.4-alt1: build OK
2013-Feb-21 13:33:02 :: [x86_64] #2600 python-module-CleverCSS.git 0.1-alt2: build start
2013-Feb-21 13:33:40 :: [x86_64] #2600 python-module-CleverCSS.git 0.1-alt2: build OK
2013-Feb-21 13:33:40 :: [x86_64] #2700 python-module-cmd2.git 0.6.4-alt5: build start
2013-Feb-21 13:34:27 :: [i586] #2400 python-module-chameleon.core.git 2.11-alt1.git20130114: build OK
2013-Feb-21 13:34:27 :: [i586] #2440 python-module-markdown.git 2.1.1-alt1: build start
2013-Feb-21 13:34:33 :: [x86_64] #2700 python-module-cmd2.git 0.6.4-alt5: build OK
2013-Feb-21 13:34:33 :: [x86_64] #3000 python-module-codepy.git 2012.1.2-alt1.git20120607: build start
2013-Feb-21 13:34:39 :: [i586] python-module-markdown.git 2.1.1-alt1: remote: no need to rebuild
2013-Feb-21 13:34:39 :: [i586] #2440 python-module-markdown.git 2.1.1-alt1: build OK
2013-Feb-21 13:34:39 :: [i586] #2500 python-module-cheetah.git 2.4.4-alt1: build start
2013-Feb-21 13:35:34 :: [x86_64] #3000 python-module-codepy.git 2012.1.2-alt1.git20120607: build OK
2013-Feb-21 13:35:34 :: [x86_64] #3100 python-module-colormath.git 1.0.8-alt2.git20121128: build start
2013-Feb-21 13:35:47 :: [x86_64] python-module-colormath.git 1.0.8-alt2.git20121128: remote: no need to rebuild
2013-Feb-21 13:35:47 :: [x86_64] #3100 python-module-colormath.git 1.0.8-alt2.git20121128: build OK
2013-Feb-21 13:35:47 :: [x86_64] #3200 python-module-cryptacular.git 1.4.1-alt1: build start
2013-Feb-21 13:36:43 :: [x86_64] #3200 python-module-cryptacular.git 1.4.1-alt1: build OK
2013-Feb-21 13:36:43 :: [x86_64] #3300 python-module-cvxopt.git 1.1.5-alt3: build start
2013-Feb-21 13:38:03 :: [i586] #2500 python-module-cheetah.git 2.4.4-alt1: build OK
2013-Feb-21 13:38:03 :: [i586] #2600 python-module-CleverCSS.git 0.1-alt2: build start
2013-Feb-21 13:38:42 :: [i586] #2600 python-module-CleverCSS.git 0.1-alt2: build OK
2013-Feb-21 13:38:42 :: [i586] #2700 python-module-cmd2.git 0.6.4-alt5: build start
2013-Feb-21 13:39:37 :: [i586] #2700 python-module-cmd2.git 0.6.4-alt5: build OK
2013-Feb-21 13:39:37 :: [i586] #3000 python-module-codepy.git 2012.1.2-alt1.git20120607: build start
2013-Feb-21 13:40:40 :: [i586] #3000 python-module-codepy.git 2012.1.2-alt1.git20120607: build OK
2013-Feb-21 13:40:40 :: [i586] #3100 python-module-colormath.git 1.0.8-alt2.git20121128: build start
2013-Feb-21 13:40:53 :: [i586] python-module-colormath.git 1.0.8-alt2.git20121128: remote: no need to rebuild
2013-Feb-21 13:40:53 :: [i586] #3100 python-module-colormath.git 1.0.8-alt2.git20121128: build OK
2013-Feb-21 13:40:53 :: [i586] #3200 python-module-cryptacular.git 1.4.1-alt1: build start
2013-Feb-21 13:41:51 :: [i586] #3200 python-module-cryptacular.git 1.4.1-alt1: build OK
2013-Feb-21 13:41:51 :: [i586] #3300 python-module-cvxopt.git 1.1.5-alt3: build start
2013-Feb-21 13:43:24 :: [x86_64] #3300 python-module-cvxopt.git 1.1.5-alt3: build OK
2013-Feb-21 13:43:24 :: [x86_64] #3320 python-module-numpy.git 2.0.0-alt7.git20121009: build start
2013-Feb-21 13:49:18 :: [i586] #3300 python-module-cvxopt.git 1.1.5-alt3: build OK
2013-Feb-21 13:49:18 :: [i586] #3320 python-module-numpy.git 2.0.0-alt7.git20121009: build start
2013-Feb-21 14:12:08 :: [x86_64] #3320 python-module-numpy.git 2.0.0-alt7.git20121009: build OK
2013-Feb-21 14:12:08 :: [x86_64] #3344 python-module-babel.git 0.9.6-alt1: build start
<13>Feb 21 14:12:25 rpmi: libfreetype-2.4.11-alt1 installed
<13>Feb 21 14:12:25 rpmi: libexpat-2.1.0-alt1 installed
<13>Feb 21 14:12:25 rpmi: fontconfig-2.10.91-alt3 installed
Updating fonts cache: <29>Feb 21 14:12:27 fontconfig: Updating fonts cache: succeeded
[ DONE ]
<13>Feb 21 14:12:27 rpmi: libtcl-8.5.9-alt2 installed
<13>Feb 21 14:12:27 rpmi: libkeyutils-1.5.1-alt1 installed
<13>Feb 21 14:12:27 rpmi: libgdbm-1.8.3-alt9 installed
<13>Feb 21 14:12:27 rpmi: libcom_err-1.42.6-alt1 installed
<13>Feb 21 14:12:27 rpmi: libXdmcp-1.1.1-alt1 installed
<13>Feb 21 14:12:27 rpmi: libXau-1.0.7-alt1 installed
<13>Feb 21 14:12:27 rpmi: libxcb-1.9-alt1 installed
<13>Feb 21 14:12:27 rpmi: libX11-locales-3:1.5.0-alt1 installed
<13>Feb 21 14:12:27 rpmi: libX11-3:1.5.0-alt1 installed
<13>Feb 21 14:12:27 rpmi: libXrender-0.9.7-alt1 installed
<13>Feb 21 14:12:27 rpmi: libXft-2.3.1-alt1 installed
<13>Feb 21 14:12:27 rpmi: libtk-8.5.9-alt3 installed
<13>Feb 21 14:12:27 rpmi: ca-certificates-2012.01.17-alt1 installed
<13>Feb 21 14:12:27 rpmi: libcrypto10-1.0.0j-alt1 installed
<13>Feb 21 14:12:27 rpmi: libkrb5-1.11-alt2 installed
<13>Feb 21 14:12:27 rpmi: libssl10-1.0.0j-alt1 installed
<13>Feb 21 14:12:27 rpmi: python3-3.3.0-alt1 installed
<13>Feb 21 14:12:27 rpmi: python3-modules-tkinter-3.3.0-alt1 installed
<13>Feb 21 14:12:28 rpmi: python3-base-3.3.0-alt1 installed
<13>Feb 21 14:12:28 rpmi: rpm-build-python3-0.1.4-alt1 installed
Reading Package Lists...
Building Dependency Tree...
MI2a: mark python-module-distribute
MI2a:  target python-modules
MI2a:   mark python-modules
MI2a:    target python2.7(bisect)
MI2a:     mark python-modules-email
MI2a:    target python2.7(dis)
MI2a:     mark python-modules-compiler
MI2a:    target python2.7(encodings)
MI2a:     mark python-modules-encodings
MI2a:    target python2.7(unittest)
MI2a:     mark python-modules-unittest
MI2a:  target python2.7(distutils)
MI2a:   mark python-dev
MI2a:    target python
MI2a:     mark python
MI2a:      target python-modules-curses
MI2a:       mark python-modules-curses
MI2a:      target python-modules-xml
MI2a:       mark python-modules-xml
MI2a:      target python-modules-hotshot
MI2a:       mark python-modules-hotshot
MI2a:      target python-modules-bsddb
MI2a:       mark python-modules-bsddb
MI2a:      target python-modules-logging
MI2a:       mark python-modules-logging
MI2a:        target python-modules-multiprocessing
MI2a:         mark python-modules-multiprocessing
MI2a:          target python-modules-ctypes
MI2a:           mark python-modules-ctypes
MI2a:    target /usr/lib64/libpython2.7.so.1.0
MI2a:     mark libpython
MI2a:    target libncurses-devel
MI2a:     mark libncurses-devel
MI2a:      target libtinfo-devel
MI2a:       mark libtinfo-devel
MI2a: mark python-module-pytz
MI2a:  target python AMB
MI2b: mark python-module-pytz
MI2b:  target python AMB
MI2c: mark python-module-pytz
MI2c:  target python
MI2c:   mark python-strict
MI2a: mark python3-dev
MI2a:  target libpython3
MI2a:   mark libpython3
MI2a: mark python3-module-pytz
Starting
Starting 2
Selecting python-module-distribute for 'python-module-setuptools'
Selecting python-module-distribute for 'python2.7(setuptools.command.test)'
Selecting python-module-pytz for 'python2.7(pytz)'
Version python-dev#2.7.3-alt4 for python-devel=2.7 is already selected for install
Version rpm-build-python#0.36.1-alt1 for rpm-build-python>=0.8 is already installed
rpm-build-python is already the newest version.
rpm-build-python3 is already the newest version.
Selecting python3-dev for 'python3-devel'
Investigating python3-module-pytz
Package python3-module-pytz has broken dep on python3.2(bisect)
  Considering python3-base 9 as a solution to python3-module-pytz 9999
Package python3-module-pytz has broken dep on python3.2(datetime)
  Considering python3-base 9 as a solution to python3-module-pytz 9999
Package python3-module-pytz has broken dep on python3.2(gettext)
  Considering python3-base 9 as a solution to python3-module-pytz 9999
Package python3-module-pytz has broken dep on python3.2(os)
  Considering python3-base 9 as a solution to python3-module-pytz 9999
Package python3-module-pytz has broken dep on python3.2(struct)
  Considering python3-base 9 as a solution to python3-module-pytz 9999
Package python3-module-pytz has broken dep on python3.2(time)
  Considering python3-base 9 as a solution to python3-module-pytz 9999
Done
Some packages could not be installed. This may mean that you have
requested an impossible situation or if you are using the unstable
distribution that some required packages have not yet been created
or been moved out of Incoming.
The following information may help to resolve the situation:

The following packages have unmet dependencies:
  python3-module-pytz: Depends: python3.2(bisect)
                       Depends: python3.2(datetime)
                       Depends: python3.2(gettext)
                       Depends: python3.2(os)
                       Depends: python3.2(struct)
                       Depends: python3.2(time)
E: Broken packages
hsh-install: Failed to calculate package file list.
hsh-install: Failed to generate package file list.
2013-Feb-21 14:12:30 :: [x86_64] python-module-babel.git 0.9.6-alt1: remote: cannot build src.rpm
2013-Feb-21 14:12:30 :: [x86_64] #3344 python-module-babel.git 0.9.6-alt1: build FAILED
2013-Feb-21 14:19:19 :: [i586] #3320 python-module-numpy.git 2.0.0-alt7.git20121009: build OK
2013-Feb-21 14:19:19 :: [i586] #3344 python-module-babel.git 0.9.6-alt1: build start
<13>Feb 21 14:19:33 rpmi: libfreetype-2.4.11-alt1 installed
<13>Feb 21 14:19:33 rpmi: libexpat-2.1.0-alt1 installed
<13>Feb 21 14:19:33 rpmi: fontconfig-2.10.91-alt3 installed
Updating fonts cache: <29>Feb 21 14:19:35 fontconfig: Updating fonts cache: succeeded
[ DONE ]
<13>Feb 21 14:19:35 rpmi: libtcl-8.5.9-alt2 installed
<13>Feb 21 14:19:35 rpmi: libkeyutils-1.5.1-alt1 installed
<13>Feb 21 14:19:35 rpmi: libgdbm-1.8.3-alt9 installed
<13>Feb 21 14:19:35 rpmi: libcom_err-1.42.6-alt1 installed
<13>Feb 21 14:19:35 rpmi: libXdmcp-1.1.1-alt1 installed
<13>Feb 21 14:19:35 rpmi: libXau-1.0.7-alt1 installed
<13>Feb 21 14:19:35 rpmi: libxcb-1.9-alt1 installed
<13>Feb 21 14:19:35 rpmi: libX11-locales-3:1.5.0-alt1 installed
<13>Feb 21 14:19:35 rpmi: libX11-3:1.5.0-alt1 installed
<13>Feb 21 14:19:35 rpmi: libXrender-0.9.7-alt1 installed
<13>Feb 21 14:19:35 rpmi: libXft-2.3.1-alt1 installed
<13>Feb 21 14:19:35 rpmi: libtk-8.5.9-alt3 installed
<13>Feb 21 14:19:35 rpmi: ca-certificates-2012.01.17-alt1 installed
<13>Feb 21 14:19:35 rpmi: libcrypto10-1.0.0j-alt1 installed
<13>Feb 21 14:19:35 rpmi: libkrb5-1.11-alt2 installed
<13>Feb 21 14:19:35 rpmi: libssl10-1.0.0j-alt1 installed
<13>Feb 21 14:19:35 rpmi: python3-3.3.0-alt1 installed
<13>Feb 21 14:19:35 rpmi: python3-modules-tkinter-3.3.0-alt1 installed
<13>Feb 21 14:19:36 rpmi: python3-base-3.3.0-alt1 installed
<13>Feb 21 14:19:36 rpmi: rpm-build-python3-0.1.4-alt1 installed
Reading Package Lists...
Building Dependency Tree...
MI2a: mark python-module-distribute
MI2a:  target python-modules
MI2a:   mark python-modules
MI2a:    target python2.7(bisect)
MI2a:     mark python-modules-email
MI2a:    target python2.7(dis)
MI2a:     mark python-modules-compiler
MI2a:    target python2.7(encodings)
MI2a:     mark python-modules-encodings
MI2a:    target python2.7(unittest)
MI2a:     mark python-modules-unittest
MI2a:  target python2.7(distutils)
MI2a:   mark python-dev
MI2a:    target python
MI2a:     mark python
MI2a:      target python-modules-curses
MI2a:       mark python-modules-curses
MI2a:      target python-modules-xml
MI2a:       mark python-modules-xml
MI2a:      target python-modules-hotshot
MI2a:       mark python-modules-hotshot
MI2a:      target python-modules-bsddb
MI2a:       mark python-modules-bsddb
MI2a:      target python-modules-logging
MI2a:       mark python-modules-logging
MI2a:        target python-modules-multiprocessing
MI2a:         mark python-modules-multiprocessing
MI2a:          target python-modules-ctypes
MI2a:           mark python-modules-ctypes
MI2a:    target /usr/lib/libpython2.7.so.1.0
MI2a:     mark libpython
MI2a:    target libncurses-devel
MI2a:     mark libncurses-devel
MI2a:      target libtinfo-devel
MI2a:       mark libtinfo-devel
MI2a: mark python-module-pytz
MI2a:  target python AMB
MI2b: mark python-module-pytz
MI2b:  target python AMB
MI2c: mark python-module-pytz
MI2c:  target python
MI2c:   mark python-strict
MI2a: mark python3-dev
MI2a:  target libpython3
MI2a:   mark libpython3
MI2a: mark python3-module-pytz
Starting
Starting 2
Selecting python-module-distribute for 'python-module-setuptools'
Selecting python-module-distribute for 'python2.7(setuptools.command.test)'
Selecting python-module-pytz for 'python2.7(pytz)'
Version python-dev#2.7.3-alt4 for python-devel=2.7 is already selected for install
Version rpm-build-python#0.36.1-alt1 for rpm-build-python>=0.8 is already installed
rpm-build-python is already the newest version.
rpm-build-python3 is already the newest version.
Selecting python3-dev for 'python3-devel'
Investigating python3-module-pytz
Package python3-module-pytz has broken dep on python3.2(bisect)
  Considering python3-base 9 as a solution to python3-module-pytz 9999
Package python3-module-pytz has broken dep on python3.2(datetime)
  Considering python3-base 9 as a solution to python3-module-pytz 9999
Package python3-module-pytz has broken dep on python3.2(gettext)
  Considering python3-base 9 as a solution to python3-module-pytz 9999
Package python3-module-pytz has broken dep on python3.2(os)
  Considering python3-base 9 as a solution to python3-module-pytz 9999
Package python3-module-pytz has broken dep on python3.2(struct)
  Considering python3-base 9 as a solution to python3-module-pytz 9999
Package python3-module-pytz has broken dep on python3.2(time)
  Considering python3-base 9 as a solution to python3-module-pytz 9999
Done
Some packages could not be installed. This may mean that you have
requested an impossible situation or if you are using the unstable
distribution that some required packages have not yet been created
or been moved out of Incoming.
The following information may help to resolve the situation:

The following packages have unmet dependencies:
  python3-module-pytz: Depends: python3.2(bisect)
                       Depends: python3.2(datetime)
                       Depends: python3.2(gettext)
                       Depends: python3.2(os)
                       Depends: python3.2(struct)
                       Depends: python3.2(time)
E: Broken packages
hsh-install: Failed to calculate package file list.
hsh-install: Failed to generate package file list.
2013-Feb-21 14:19:38 :: [i586] python-module-babel.git 0.9.6-alt1: remote: cannot build src.rpm
2013-Feb-21 14:19:38 :: [i586] #3344 python-module-babel.git 0.9.6-alt1: build FAILED
2013-Feb-21 14:12:31 :: [x86_64] build FAILED
2013-Feb-21 14:19:38 :: [i586] build FAILED
2013-Feb-21 14:19:38 :: task #89971 for sisyphus FAILED


More information about the Sisyphus-incominger mailing list