[#89971] FAILED (try 29) python3.git=3.3.0-alt1 boost.git=1.53.0-alt3 ...

Girar Builder robot girar-builder at altlinux.org
Tue Feb 19 16:47:42 MSK 2013


http://git.altlinux.org/tasks/89971/logs/events.29.1.log

2013-Feb-19 11:20:19 :: test-only shared task #89971 for sisyphus resumed by solo:
#100 removed
#101 removed
#102 removed
#103 build 3.3.0-alt1 from /people/solo/packages/python3.git
#104 removed
#110 removed
#120 removed
#140 removed
#200 removed
#220 removed
#240 removed
#300 removed
#400 build 1.53.0-alt3 from /people/iv/packages/boost.git
#500 build 1.4-alt3.git20120704 from /gears/e/engrid.git
#504 build 0.6.35-alt1 from /people/solo/packages/python-module-distribute.git
#510 build 2.7-alt1.git20120313 from /gears/p/python-module-jinja2.git
#514 build 1.6-alt1 from /gears/p/python-module-Pygments.git
#516 build 0.11-alt1.svn20130117 from /gears/p/python-module-docutils.git
#517 removed
#520 removed
#540 removed
#542 build 3.6.1-alt2.a0.hg20130202 from /people/solo/packages/python-module-coverage.git
#544 removed
#545 build 1.2.1-alt1.git8fa890fa from /people/solo/packages/python-module-nose.git
#546 removed
#547 removed
#550 removed
#554 build 2.3.3.20130205-alt2 from /gears/p/python-module-objects.inv.git
#560 build 1.1.3-alt4 from /gears/p/python-module-sphinx.git
#600 build 1.4.13-alt1.dev3.hg20130127 from /gears/p/py.git
#620 build 0.7.10-alt1 from /gears/p/python-module-SQLAlchemy.git
#630 build 2.4.1-alt1 from /people/solo/packages/python-module-whoosh.git
#634 build py3-1.1.2-alt1.1 from /people/solo/packages/shiboken-py3.git
#640 removed
#700 build py3-1.1.2-alt1 from /gears/p/pyside-qt4-py3.git
#1000 build 0.2.14-alt2.git20120427 from /gears/p/pyside-tools-py3.git
#1100 build 2.0-alt1 from /gears/p/python3-module-dateutil.git
#1140 build 1.1.1-alt3.1 from /people/solo/packages/python3-module-dbus.git
#1160 build py3-1.10.1-alt3.git20120819.1 from /people/solo/packages/python3-module-pycairo.git
#1200 removed
#1300 build 1.6.1-alt1 from /gears/p/python3-module-jsonlib.git
#1400 build 1.2.3-alt1.git20111005 from /gears/p/python3-module-MySQLdb.git
#1500 removed
#1600 build 1.0.15-alt1.hg20110706 from /gears/p/python3-module-pydot.git
#1700 build 20110416-alt1 from /gears/p/python3-module-rfc822py3.git
#2000 build 1.0.0-alt1.hg20100824 from /gears/p/python3-module-sgmllib.git
#2100 build 0.1.2-alt1 from /gears/p/python3-module-xlwt3.git
#2200 build 1.2-alt2.hg20110331 from /gears/p/python-module-argparse.git
#2300 build 1.6.4-alt1 from /gears/p/python-module-beaker.git
#2400 build 2.11-alt1.git20130114 from /gears/p/python-module-chameleon.core.git
#2500 build 2.4.4-alt1 from /gears/p/python-module-cheetah.git
#2600 build 0.1-alt2 from /gears/p/python-module-CleverCSS.git
#2700 build 0.6.4-alt5 from /gears/p/python-module-cmd2.git
#3000 build 2012.1.2-alt1.git20120607 from /gears/p/python-module-codepy.git
#3100 build 1.0.8-alt2.git20121128 from /gears/p/python-module-colormath.git
#3200 build 1.4.1-alt1 from /gears/p/python-module-cryptacular.git
#3300 build 1.1.5-alt3 from /gears/p/python-module-cvxopt.git
#3400 build 0.1-alt1.svn20130211 from /gears/p/python-module-cvxpy.git
#3500 build 3.0.3-alt1 from /gears/p/python-module-DateTime.git
#3600 build 3.4.0-alt1 from /gears/p/python-module-decorator.git
#3700 build 0.3-alt1 from /gears/p/python-module-dobbin.git
#4000 build 0.16-alt1 from /gears/p/python-module-fanstatic.git
#4100 build 1.0.3-alt1.hg20120223 from /gears/p/python-module-flup.git
#4200 build 0.9.2-alt1 from /gears/p/python-module-fastimport.git
#4300 build 0.6-alt2 from /gears/p/python-module-genshi.git
#4400 build 0.3.6-alt1.git20130201 from /gears/p/python-module-gevent-socketio.git
#4500 build 0.3.6-alt1.hg20120723 from /gears/p/python-module-gevent-websocket.git
#4600 build 0.95-alt3 from /gears/p/python-module-html5lib.git
#4700 build 0.1.1-alt2.svn20090926 from /gears/p/python-module-httpencode.git
#5000 build 0.7.7-alt1 from /gears/p/python-module-httplib2.git
#5100 build 1.1.1-alt2 from /gears/p/python-module-interlude.git
#5200 removed
#5300 build 0.5.0-alt1.hg20120329 from /gears/p/python-module-logilab-constraint.git
2013-Feb-19 11:20:20 :: waiting for a shared lock on sisyphus
2013-Feb-19 11:21:01 :: acquired a shared lock on sisyphus
2013-Feb-19 11:21:17 :: created build repo
2013-Feb-19 11:21:18 :: [x86_64] #103 python3.git 3.3.0-alt1: build start
2013-Feb-19 11:21:18 :: [i586] #103 python3.git 3.3.0-alt1: build start
2013-Feb-19 11:21:53 :: [i586] python3.git 3.3.0-alt1: remote: no need to rebuild
2013-Feb-19 11:21:53 :: [x86_64] python3.git 3.3.0-alt1: remote: no need to rebuild
2013-Feb-19 11:21:53 :: [i586] #103 python3.git 3.3.0-alt1: build OK
2013-Feb-19 11:21:53 :: [i586] #400 boost.git 1.53.0-alt3: build start
2013-Feb-19 11:21:54 :: [x86_64] #103 python3.git 3.3.0-alt1: build OK
2013-Feb-19 11:21:54 :: [x86_64] #400 boost.git 1.53.0-alt3: build start
2013-Feb-19 11:22:34 :: [i586] boost.git 1.53.0-alt3: remote: no need to rebuild
2013-Feb-19 11:22:35 :: [x86_64] boost.git 1.53.0-alt3: remote: no need to rebuild
2013-Feb-19 11:22:40 :: [i586] #400 boost.git 1.53.0-alt3: build OK
2013-Feb-19 11:22:40 :: [i586] #500 engrid.git 1.4-alt3.git20120704: build start
2013-Feb-19 11:22:44 :: [x86_64] #400 boost.git 1.53.0-alt3: build OK
2013-Feb-19 11:22:44 :: [x86_64] #500 engrid.git 1.4-alt3.git20120704: build start
2013-Feb-19 11:23:08 :: [i586] engrid.git 1.4-alt3.git20120704: remote: no need to rebuild
2013-Feb-19 11:23:09 :: [i586] #500 engrid.git 1.4-alt3.git20120704: build OK
2013-Feb-19 11:23:09 :: [i586] #504 python-module-distribute.git 0.6.35-alt1: build start
2013-Feb-19 11:23:15 :: [x86_64] engrid.git 1.4-alt3.git20120704: remote: no need to rebuild
2013-Feb-19 11:23:18 :: [x86_64] #500 engrid.git 1.4-alt3.git20120704: build OK
2013-Feb-19 11:23:18 :: [x86_64] #504 python-module-distribute.git 0.6.35-alt1: build start
2013-Feb-19 11:23:24 :: [i586] python-module-distribute.git 0.6.35-alt1: remote: no need to rebuild
2013-Feb-19 11:23:24 :: [i586] #504 python-module-distribute.git 0.6.35-alt1: build OK
2013-Feb-19 11:23:24 :: [i586] #510 python-module-jinja2.git 2.7-alt1.git20120313: build start
2013-Feb-19 11:23:32 :: [x86_64] python-module-distribute.git 0.6.35-alt1: remote: no need to rebuild
2013-Feb-19 11:23:32 :: [x86_64] #504 python-module-distribute.git 0.6.35-alt1: build OK
2013-Feb-19 11:23:32 :: [x86_64] #510 python-module-jinja2.git 2.7-alt1.git20120313: build start
2013-Feb-19 11:23:39 :: [i586] python-module-jinja2.git 2.7-alt1.git20120313: remote: no need to rebuild
2013-Feb-19 11:23:39 :: [i586] #510 python-module-jinja2.git 2.7-alt1.git20120313: build OK
2013-Feb-19 11:23:39 :: [i586] #514 python-module-Pygments.git 1.6-alt1: build start
2013-Feb-19 11:23:46 :: [x86_64] python-module-jinja2.git 2.7-alt1.git20120313: remote: no need to rebuild
2013-Feb-19 11:23:46 :: [x86_64] #510 python-module-jinja2.git 2.7-alt1.git20120313: build OK
2013-Feb-19 11:23:46 :: [x86_64] #514 python-module-Pygments.git 1.6-alt1: build start
2013-Feb-19 11:26:14 :: [i586] #514 python-module-Pygments.git 1.6-alt1: build OK
2013-Feb-19 11:26:14 :: [i586] #516 python-module-docutils.git 0.11-alt1.svn20130117: build start
2013-Feb-19 11:26:30 :: [i586] python-module-docutils.git 0.11-alt1.svn20130117: remote: no need to rebuild
2013-Feb-19 11:26:30 :: [i586] #516 python-module-docutils.git 0.11-alt1.svn20130117: build OK
2013-Feb-19 11:26:30 :: [i586] #542 python-module-coverage.git 3.6.1-alt2.a0.hg20130202: build start
2013-Feb-19 11:26:34 :: [x86_64] #514 python-module-Pygments.git 1.6-alt1: build OK
2013-Feb-19 11:26:34 :: [x86_64] #516 python-module-docutils.git 0.11-alt1.svn20130117: build start
2013-Feb-19 11:26:49 :: [x86_64] python-module-docutils.git 0.11-alt1.svn20130117: remote: no need to rebuild
2013-Feb-19 11:26:50 :: [x86_64] #516 python-module-docutils.git 0.11-alt1.svn20130117: build OK
2013-Feb-19 11:26:50 :: [x86_64] #542 python-module-coverage.git 3.6.1-alt2.a0.hg20130202: build start
2013-Feb-19 11:27:42 :: [i586] #542 python-module-coverage.git 3.6.1-alt2.a0.hg20130202: build OK
2013-Feb-19 11:27:42 :: [i586] #545 python-module-nose.git 1.2.1-alt1.git8fa890fa: build start
2013-Feb-19 11:27:58 :: [x86_64] #542 python-module-coverage.git 3.6.1-alt2.a0.hg20130202: build OK
2013-Feb-19 11:27:58 :: [x86_64] #545 python-module-nose.git 1.2.1-alt1.git8fa890fa: build start
2013-Feb-19 11:29:53 :: [i586] #545 python-module-nose.git 1.2.1-alt1.git8fa890fa: build OK
2013-Feb-19 11:29:53 :: [i586] #554 python-module-objects.inv.git 2.3.3.20130205-alt2: build start
2013-Feb-19 11:30:07 :: [i586] python-module-objects.inv.git 2.3.3.20130205-alt2: remote: no need to rebuild
2013-Feb-19 11:30:07 :: [i586] #554 python-module-objects.inv.git 2.3.3.20130205-alt2: build OK
2013-Feb-19 11:30:07 :: [i586] #560 python-module-sphinx.git 1.1.3-alt4: build start
2013-Feb-19 11:30:10 :: [x86_64] #545 python-module-nose.git 1.2.1-alt1.git8fa890fa: build OK
2013-Feb-19 11:30:10 :: [x86_64] #554 python-module-objects.inv.git 2.3.3.20130205-alt2: build start
2013-Feb-19 11:30:24 :: [x86_64] python-module-objects.inv.git 2.3.3.20130205-alt2: remote: no need to rebuild
2013-Feb-19 11:30:24 :: [x86_64] #554 python-module-objects.inv.git 2.3.3.20130205-alt2: build OK
2013-Feb-19 11:30:24 :: [x86_64] #560 python-module-sphinx.git 1.1.3-alt4: build start
2013-Feb-19 11:36:44 :: [i586] #560 python-module-sphinx.git 1.1.3-alt4: build OK
2013-Feb-19 11:36:44 :: [i586] #600 py.git 1.4.13-alt1.dev3.hg20130127: build start
2013-Feb-19 11:36:48 :: [x86_64] #560 python-module-sphinx.git 1.1.3-alt4: build OK
2013-Feb-19 11:36:48 :: [x86_64] #600 py.git 1.4.13-alt1.dev3.hg20130127: build start
2013-Feb-19 11:36:57 :: [i586] py.git 1.4.13-alt1.dev3.hg20130127: remote: no need to rebuild
2013-Feb-19 11:36:58 :: [i586] #600 py.git 1.4.13-alt1.dev3.hg20130127: build OK
2013-Feb-19 11:36:58 :: [i586] #620 python-module-SQLAlchemy.git 0.7.10-alt1: build start
2013-Feb-19 11:37:01 :: [x86_64] py.git 1.4.13-alt1.dev3.hg20130127: remote: no need to rebuild
2013-Feb-19 11:37:01 :: [x86_64] #600 py.git 1.4.13-alt1.dev3.hg20130127: build OK
2013-Feb-19 11:37:02 :: [x86_64] #620 python-module-SQLAlchemy.git 0.7.10-alt1: build start
2013-Feb-19 11:37:12 :: [i586] python-module-SQLAlchemy.git 0.7.10-alt1: remote: no need to rebuild
2013-Feb-19 11:37:13 :: [i586] #620 python-module-SQLAlchemy.git 0.7.10-alt1: build OK
2013-Feb-19 11:37:13 :: [i586] #630 python-module-whoosh.git 2.4.1-alt1: build start
2013-Feb-19 11:37:16 :: [x86_64] python-module-SQLAlchemy.git 0.7.10-alt1: remote: no need to rebuild
2013-Feb-19 11:37:16 :: [x86_64] #620 python-module-SQLAlchemy.git 0.7.10-alt1: build OK
2013-Feb-19 11:37:16 :: [x86_64] #630 python-module-whoosh.git 2.4.1-alt1: build start
2013-Feb-19 11:39:00 :: [x86_64] #630 python-module-whoosh.git 2.4.1-alt1: build OK
2013-Feb-19 11:39:00 :: [x86_64] #634 shiboken-py3.git py3-1.1.2-alt1.1: build start
2013-Feb-19 11:39:01 :: [i586] #630 python-module-whoosh.git 2.4.1-alt1: build OK
2013-Feb-19 11:39:01 :: [i586] #634 shiboken-py3.git py3-1.1.2-alt1.1: build start
2013-Feb-19 11:46:43 :: [x86_64] #634 shiboken-py3.git py3-1.1.2-alt1.1: build OK
2013-Feb-19 11:46:43 :: [x86_64] #700 pyside-qt4-py3.git py3-1.1.2-alt1: build start
2013-Feb-19 11:47:15 :: [i586] #634 shiboken-py3.git py3-1.1.2-alt1.1: build OK
2013-Feb-19 11:47:15 :: [i586] #700 pyside-qt4-py3.git py3-1.1.2-alt1: build start
2013-Feb-19 12:40:11 :: [x86_64] #700 pyside-qt4-py3.git py3-1.1.2-alt1: build OK
2013-Feb-19 12:40:11 :: [x86_64] #1000 pyside-tools-py3.git 0.2.14-alt2.git20120427: build start
2013-Feb-19 12:41:30 :: [x86_64] #1000 pyside-tools-py3.git 0.2.14-alt2.git20120427: build OK
2013-Feb-19 12:41:30 :: [x86_64] #1100 python3-module-dateutil.git 2.0-alt1: build start
2013-Feb-19 12:41:43 :: [x86_64] python3-module-dateutil.git 2.0-alt1: remote: no need to rebuild
2013-Feb-19 12:41:43 :: [x86_64] #1100 python3-module-dateutil.git 2.0-alt1: build OK
2013-Feb-19 12:41:43 :: [x86_64] #1140 python3-module-dbus.git 1.1.1-alt3.1: build start
2013-Feb-19 12:43:00 :: [x86_64] #1140 python3-module-dbus.git 1.1.1-alt3.1: build OK
2013-Feb-19 12:43:00 :: [x86_64] #1160 python3-module-pycairo.git py3-1.10.1-alt3.git20120819.1: build start
2013-Feb-19 12:43:20 :: [i586] #700 pyside-qt4-py3.git py3-1.1.2-alt1: build OK
2013-Feb-19 12:43:20 :: [i586] #1000 pyside-tools-py3.git 0.2.14-alt2.git20120427: build start
    return codecs.ascii_decode(input, self.errors)[0]
UnicodeDecodeError: 'ascii' codec can't decode byte 0xc2 in position 14: ordinal not in range(128)
2013-Feb-19 12:44:12 :: [x86_64] python3-module-pycairo.git py3-1.10.1-alt3.git20120819.1: remote: build failed
2013-Feb-19 12:44:12 :: [x86_64] #1160 python3-module-pycairo.git py3-1.10.1-alt3.git20120819.1: build FAILED
2013-Feb-19 12:44:46 :: [i586] #1000 pyside-tools-py3.git 0.2.14-alt2.git20120427: build OK
2013-Feb-19 12:44:46 :: [i586] #1100 python3-module-dateutil.git 2.0-alt1: build start
2013-Feb-19 12:45:00 :: [i586] python3-module-dateutil.git 2.0-alt1: remote: no need to rebuild
2013-Feb-19 12:45:00 :: [i586] #1100 python3-module-dateutil.git 2.0-alt1: build OK
2013-Feb-19 12:45:00 :: [i586] #1140 python3-module-dbus.git 1.1.1-alt3.1: build start
2013-Feb-19 12:46:26 :: [i586] #1140 python3-module-dbus.git 1.1.1-alt3.1: build OK
2013-Feb-19 12:46:26 :: [i586] #1160 python3-module-pycairo.git py3-1.10.1-alt3.git20120819.1: build start
    return codecs.ascii_decode(input, self.errors)[0]
UnicodeDecodeError: 'ascii' codec can't decode byte 0xc2 in position 14: ordinal not in range(128)
2013-Feb-19 12:47:40 :: [i586] python3-module-pycairo.git py3-1.10.1-alt3.git20120819.1: remote: build failed
2013-Feb-19 12:47:40 :: [i586] #1160 python3-module-pycairo.git py3-1.10.1-alt3.git20120819.1: build FAILED
2013-Feb-19 12:44:12 :: [x86_64] build FAILED
2013-Feb-19 12:47:41 :: [i586] build FAILED
2013-Feb-19 12:47:41 :: task #89971 for sisyphus FAILED


More information about the Sisyphus-incominger mailing list