[#16330] FAILED lazarus.git=0.9.28-alt6
Girar Builder robot
girar-builder ÎÁ altlinux.org
ðÔ îÏÑ 20 15:35:59 UTC 2009
http://git.altlinux.org/tasks/16330/task/log
2009-Nov-20 18:30:03 :: task #16330 for sisyphus started:
#1 build 0.9.28-alt6 from /people/ashen/packages/lazarus.git
2009-Nov-20 18:30:09 :: created pkg.tar for lazarus.git tag 0.9.28-alt6
2009-Nov-20 18:30:12 :: [i586] lazarus.git 0.9.28-alt6: build start
2009-Nov-20 18:30:12 :: [x86_64] lazarus.git 0.9.28-alt6: build start
Пpоцедypа/Фyнкци� TZPostgreSQLDatabaseMetadata.UncachedGetCrossReference(const AnsiString,const AnsiString,const AnsiString,const AnsiString,const AnsiString,const AnsiString):IZResultSet;
ZDbcPostgreSqlMetadata.pas(2498,11) Error: Пеpеключатели компил�тоpа не позвол�ют и�пользовать (* и *) �тиль комментаpиев.
ZDbcPostgreSqlMetadata.pas(2499,11) Error: Пеpеключатели компил�тоpа не позвол�ют и�пользовать (* и *) �тиль комментаpиев.
Пpоцедypа/Фyнкци� TZPostgreSQLDatabaseMetadata.UncachedGetTypeInfo:IZResultSet;
--
ZDbcPostgreSqlMetadata.pas(2954) Fatal: Обнаpyжено 2 ошибок пpи компилиpовании модyл�, о�танавливаем��
Fatal: Compilation aborted
make[2]: *** [zdbc.ppu] Error 1
2009-Nov-20 18:35:43 :: [i586] lazarus.git 0.9.28-alt6: remote: build failed
2009-Nov-20 18:35:43 :: [i586] lazarus.git 0.9.28-alt6: build FAILED
Пpоцедypа/Фyнкци� TZPostgreSQLDatabaseMetadata.UncachedGetCrossReference(const AnsiString,const AnsiString,const AnsiString,const AnsiString,const AnsiString,const AnsiString):IZResultSet;
ZDbcPostgreSqlMetadata.pas(2498,11) Error: Пеpеключатели компил�тоpа не позвол�ют и�пользовать (* и *) �тиль комментаpиев.
ZDbcPostgreSqlMetadata.pas(2499,11) Error: Пеpеключатели компил�тоpа не позвол�ют и�пользовать (* и *) �тиль комментаpиев.
Пpоцедypа/Фyнкци� TZPostgreSQLDatabaseMetadata.UncachedGetTypeInfo:IZResultSet;
--
ZDbcPostgreSqlMetadata.pas(2954) Fatal: Обнаpyжено 2 ошибок пpи компилиpовании модyл�, о�танавливаем��
Fatal: Compilation aborted
make[2]: *** [zdbc.ppu] Error 1
2009-Nov-20 18:35:58 :: [x86_64] lazarus.git 0.9.28-alt6: remote: build failed
2009-Nov-20 18:35:59 :: [x86_64] lazarus.git 0.9.28-alt6: build FAILED
2009-Nov-20 18:35:44 :: [i586] build FAILED
2009-Nov-20 18:35:59 :: [x86_64] build FAILED
2009-Nov-20 18:35:59 :: task #16330 for sisyphus FAILED
ðÏÄÒÏÂÎÁÑ ÉÎÆÏÒÍÁÃÉÑ Ï ÓÐÉÓËÅ ÒÁÓÓÙÌËÉ Sisyphus-incominger