[cyber] I: Sisyphus-20250520 x86_64 beehive_status: +22 -17 (319)
ALT beekeeper
hiver на altlinux.org
Вт Май 20 09:19:21 MSK 2025
22 NEW error logs
Cardinal-24.12-alt1
ld: ../../carla/build/modules/Release/jackbridge.min.a: error adding symbols: archive
has no index; run ranlib to add one
collect2: error: ld returned 1 exit status
make[2]: *** [../../dpf/Makefile.plugins.mk:557: ../../bin/Cardinal] Error 1
--
ld: ../../carla/build/modules/Release/jackbridge.min.a: error adding symbols: archive
has no index; run ranlib to add one
collect2: error: ld returned 1 exit status
make[2]: *** [../../dpf/Makefile.plugins.mk:600: ../../bin/Cardinal.lv2/Cardinal.so]
Error 1
auditd-plugin-clickhouse-lite-0.1.8-alt2
test/dbtest/plugin_test.py
hasher-privd: parent: handle_io: idle time limit (3600 seconds) exceeded
cryptote-0.6.0-alt3
checking for wxWidgets version >= 2.8.0... no
configure: error:
wxWidgets does not seem to be installed on your system.
elixir-1.17.3-alt1
match (=) failed
code: assert {["hello", "world"], 0} = System.cmd("echo", ["-n", "hello\nworld"], into:
[], lines: 3)
left: {["hello", "world"], 0}
right: {["hello"], 0}
stacktrace:
test/elixir/system_test.exs:200: (test)
Finished in 19.8 seconds (7.2s on load, 7.8s async, 4.7s sync)
2049 doctests, 4364 tests, 1 failure, 13 excluded
make: *** [Makefile:280: test_stdlib] Error 2
make: Leaving directory '/usr/src/RPM/BUILD/elixir-1.17.3'
freedink-dfarc-3.12-alt3
checking for wxWidgets version >= 3.0.0... no
configure: error:
wxWidgets must be installed on your system.
megaglest-3.13.0-alt3
-- Checking for one of the modules 'glib-2.0'
Package libpcre2-8 was not found in the pkg-config search path.
Perhaps you should add the directory containing `libpcre2-8.pc'
to the PKG_CONFIG_PATH environment variable
Package 'libpcre2-8', required by 'glib-2.0', not found
Package libpcre2-8 was not found in the pkg-config search path.
Perhaps you should add the directory containing `libpcre2-8.pc'
to the PKG_CONFIG_PATH environment variable
Package 'libpcre2-8', required by 'glib-2.0', not found
Package libpcre2-8 was not found in the pkg-config search path.
Perhaps you should add the directory containing `libpcre2-8.pc'
to the PKG_CONFIG_PATH environment variable
Package 'libpcre2-8', required by 'glib-2.0', not found
Package libpcre2-8 was not found in the pkg-config search path.
Perhaps you should add the directory containing `libpcre2-8.pc'
to the PKG_CONFIG_PATH environment variable
Package 'libpcre2-8', required by 'glib-2.0', not found
-- Found GLib2: glib-2.0 /usr/include/glib-2.0;/usr/lib64/glib-2.0/include
perl-Alien-wxWidgets-0.69-alt2
! LWP::Protocol::https is not installed
ERRORS/WARNINGS FOUND IN PREREQUISITES. You may wish to install the versions
of the modules indicated above before proceeding with this installation
perl-Gearman-2.004.015-alt1_5
t/40-prefix.t ................... ok
# Failed test 'timeout'
# at /usr/share/perl5/Test/Timer.pm line 31.
--
# Looks like you failed 1 test of 10.
# Failed test 'wait with timeout'
# at t/50-wait_timeout.t line 65.
--
t/50-wait_timeout.t (Wstat: 256 (exited 1) Tests: 4 Failed: 1)
Failed test: 3
Non-zero exit status: 1
--
Result: FAIL
Failed 1/24 test programs. 1/337 subtests failed.
make: *** [Makefile:782: test_dynamic] Error 255
perl-Wx-Scintilla-0.39-alt5
+ : running Build script
+ /usr/bin/perl Build
Warning: No config found to match: /usr/lib64/wx/config/gtk3-unicode-3.0 --version
in /usr/lib64/wx/config
If you require this configuration, please install the desired
library build. If this is part of an automated configuration
test and no other errors occur, you may safely ignore it.
You may use wx-config --list to see all configs available in
the default prefix.
Cannot find wx-config for wxWidgets. Perhaps you need to install wxWidgets development
libraries for your system? at inc/Module/Build/Scintilla.pm line 66.
pgadmin3-1.23.0b-alt3
checking wxWidgets version... failed
configure: error: The version of wxWidgets required (3.0) is not supported by the
installations in /usr.
protobuf-3.25.5-alt6
[ERROR] Tests run: 3, Failures: 0, Errors: 1, Skipped: 0, Time elapsed: 19.85 s <<<
FAILURE! -- in com.google.protobuf.TextFormatPerformanceTest
[ERROR]
com.google.protobuf.TextFormatPerformanceTest.testProto2ImmutableExtensionTextFormatParsing
-- Time elapsed: 10.21 s <<< ERROR!
org.junit.runners.model.TestTimedOutException: test timed out after 10000 milliseconds
python3-module-devpi-server-6.14.0-alt1
------------------------------ Captured log call -------------------------------
ERROR root:log.py:80 [NOTI] Fatal exception in thread 'TxNotificationThread'
Traceback (most recent call last):
--
2025-05-20 03:37:58,157 INFO NOCTX FIN: waiting for event-serial -1
2025-05-20 03:37:58,157 ERROR [REP] error
fetching http://localhost/+changelog/0-?initial_fetch:
requests.exceptions.ConnectionError: HTTPConnectionPool(host='localhost',
port=80): Max retries exceeded with url: /+changelog/0-?initial_fetch (Caused by
NewConnectionError('<urllib3.connection.HTTPConnection object at 0x7fab3413b1d0>:
Failed to establish a new connection: [Errno 111] Connection refused'))
------------------------------ Captured log call -------------------------------
--
INFO root:log.py:70 NOCTX FIN: waiting for event-serial -1
ERROR root:log.py:77 [REP] error fetching http://localhost/+changelog/0-?initial_fetch:
requests.exceptions.ConnectionError: HTTPConnectionPool(host='localhost',
port=80): Max retries exceeded with url: /+changelog/0-?initial_fetch (Caused by
NewConnectionError('<urllib3.connection.HTTPConnection object at 0x7fab3413b1d0>:
Failed to establish a new connection: [Errno 111] Connection refused'))
--------------------------- Captured stdout teardown ---------------------------
--
2025-05-20 03:37:58,159 INFO [REP] fetching http://localhost/+changelog/0?initial_fetch
2025-05-20 03:37:58,161 ERROR [REP] error
fetching http://localhost/+changelog/0?initial_fetch:
requests.exceptions.ConnectionError: HTTPConnectionPool(host='localhost',
port=80): Max retries exceeded with url: /+changelog/0?initial_fetch (Caused by
NewConnectionError('<urllib3.connection.HTTPConnection object at 0x7fab3413a7b0>:
Failed to establish a new connection: [Errno 111] Connection refused'))
---------------------------- Captured log teardown -----------------------------
--
INFO root:log.py:70 [REP] fetching http://localhost/+changelog/0?initial_fetch
ERROR root:log.py:77 [REP] error fetching http://localhost/+changelog/0?initial_fetch:
requests.exceptions.ConnectionError: HTTPConnectionPool(host='localhost',
port=80): Max retries exceeded with url: /+changelog/0?initial_fetch (Caused by
NewConnectionError('<urllib3.connection.HTTPConnection object at 0x7fab3413a7b0>:
Failed to establish a new connection: [Errno 111] Connection refused'))
_________________ TestStatusInfoPlugin.test_no_primary_update __________________
--
2025-05-20 03:37:58,760 INFO NOCTX FIN: waiting for event-serial -1
2025-05-20 03:37:58,761 ERROR [REP] error
fetching http://localhost/+changelog/0-?initial_fetch:
requests.exceptions.ConnectionError: HTTPConnectionPool(host='localhost',
port=80): Max retries exceeded with url: /+changelog/0-?initial_fetch (Caused by
NewConnectionError('<urllib3.connection.HTTPConnection object at 0x7fab32b32ab0>:
Failed to establish a new connection: [Errno 111] Connection refused'))
2025-05-20 03:37:58,761 INFO NOCTX waiting for event-serial -1
--
2025-05-20 03:37:58,761 INFO [REP] fetching http://localhost/+changelog/0?initial_fetch
2025-05-20 03:37:58,763 ERROR [REP] error
fetching http://localhost/+changelog/0?initial_fetch:
requests.exceptions.ConnectionError: HTTPConnectionPool(host='localhost',
port=80): Max retries exceeded with url: /+changelog/0?initial_fetch (Caused by
NewConnectionError('<urllib3.connection.HTTPConnection object at 0x7fab33f1ac00>:
Failed to establish a new connection: [Errno 111] Connection refused'))
------------------------------ Captured log call -------------------------------
--
INFO root:log.py:70 NOCTX FIN: waiting for event-serial -1
ERROR root:log.py:77 [REP] error fetching http://localhost/+changelog/0-?initial_fetch:
requests.exceptions.ConnectionError: HTTPConnectionPool(host='localhost',
port=80): Max retries exceeded with url: /+changelog/0-?initial_fetch (Caused by
NewConnectionError('<urllib3.connection.HTTPConnection object at 0x7fab32b32ab0>:
Failed to establish a new connection: [Errno 111] Connection refused'))
INFO root:log.py:70 NOCTX waiting for event-serial -1
--
INFO root:log.py:70 [REP] fetching http://localhost/+changelog/0?initial_fetch
ERROR root:log.py:77 [REP] error fetching http://localhost/+changelog/0?initial_fetch:
requests.exceptions.ConnectionError: HTTPConnectionPool(host='localhost',
port=80): Max retries exceeded with url: /+changelog/0?initial_fetch (Caused by
NewConnectionError('<urllib3.connection.HTTPConnection object at 0x7fab33f1ac00>:
Failed to establish a new connection: [Errno 111] Connection refused'))
--------------------------- Captured stdout teardown ---------------------------
--
XPASS test_devpi_server/test_views_status.py::TestStatusInfoPlugin::test_no_primary_update
- sometimes fail due to race condition in db table creation
FAILED test_devpi_server/test_mirror.py::TestMirrorStageprojects::test_simplelinks_timeout
= 1 failed, 1074 passed, 54 skipped, 1 xfailed, 3 xpassed, 50 warnings in 385.32s
(0:06:25) =
python3-module-hdf5storage-0.2-alt1.1
datetime.timedelta(seconds=mult * random.randint(-bound, bound)),
E ValueError: offset must be a timedelta strictly between -timedelta(hours=24)
and timedelta(hours=24), not datetime.timedelta(days=1).
tests/make_randoms.py:376: ValueError
--
=========================== short test summary info ============================
FAILED tests/test_write_readback.py::test_datetime_datetime[Matlab] - ValueEr...
=== 1 failed, 2447 passed, 3 skipped, 1 deselected, 1931 warnings in 23.73s ====
INFO : Command's result: FAILURE
INFO : Command's error: Command '['python3', '-m', 'pytest', '-k', 'not
test_has_required_lazy']' returned non-zero exit status 1.
python3-module-hypothesis-jsonschema-0.23.1-alt1
=========================== short test summary info ============================
FAILED tests/test_from_schema.py::test_handles_overlapping_patternproperties
FAILED tests/test_from_schema.py::test_errors_on_unencodable_property_name - ...
= 2 failed, 859 passed, 59 skipped, 109 xfailed, 2 xpassed in 1717.19s (0:28:37) =
INFO : Command's result: FAILURE
INFO : Command's error: Command '['python3', '-m', 'pytest', '-n', 'auto']' returned
non-zero exit status 1.
python3-module-mkdocs-1.6.1-alt1
.......................................................................................................................................................................................................................................................................................................................................................................................................................................................................................E...............................................s..................................................s................s...............s........................................................................................................................
ERROR: test_watch_with_broken_symlinks
(mkdocs.tests.livereload_tests.BuildTests.test_watch_with_broken_symlinks)
Traceback (most recent call last):
--
paths = [os.path.join(root, entry.name) for entry in self.listdir(root)]
OSError: [Errno 40] Too many levels of symbolic links:
'/usr/src/tmp/mkdocs_test-befmfh0q/subdir/circular/subdir/circular/subdir/circular/subdir/circular/subdir/circular/subdir/circular/subdir/circular/subdir/circular/subdir/circular/subdir/circular/subdir/circular/subdir/circular/subdir/circular/subdir/circular/subdir/circular/subdir/circular/subdir/circular/subdir/circular/subdir/circular/subdir/circular/subdir/circular/subdir/circular/subdir/circular/subdir/circular/subdir/circular/subdir/circular/subdir/circular/subdir/circular/subdir/circular/subdir/circular/subdir/circular/subdir/circular/subdir/circular/subdir/circular/subdir/circular/subdir'
Ran 724 tests in 9.794s
FAILED (errors=1, skipped=4)
INFO : Command's result: FAILURE
INFO : Command's error: Command '['python3', '-m', 'unittest', 'discover', '-p',
'*tests.py', 'mkdocs', '--top-level-directory', '.']' returned non-zero exit status 1.
error: Bad exit status from /usr/src/tmp/rpm-tmp.63344 (%check)
python3-module-pythran-0.18.0-alt1
INFO : Running command: ['python3', '-m', 'pytest', '-n', 'auto']
hasher-privd: parent: handle_io: idle time limit (3600 seconds) exceeded
python3-module-terminado-0.18.1-alt1
tests/basic_test.py::UniqueTermTests::test_large_io_doesnt_hang [32mPASSED[0m[32m
[ 77%][0m
tests/basic_test.py::UniqueTermTests::test_max_terminals [31mFAILED[0m[31m [
88%][0m
tests/basic_test.py::UniqueTermTests::test_unique_processes [32mPASSED[0m[31m
[100%][0m
--
> self.assertEqual(msg[0], "setup")
[1m[31mE TypeError: 'NoneType' object is not subscriptable[0m
msg = None
--
[36m[1m=========================== short test summary info
============================[0m
[31mFAILED[0m tests/basic_test.py::[1mUniqueTermTests::test_max_terminals[0m -
TypeError: 'NoneType' object is not subscriptable
[31m========================= [31m[1m1 failed[0m, [32m8 passed[0m[31m in
38.35s[0m[31m =========================[0m
INFO : Command's result: FAILURE
INFO : Command's error: Command '['python3', '-m', 'pytest', '-vra']' returned
non-zero exit status 1.
python3-module-uv-0.6.16-alt1
Running `rustc --crate-name uv --edition=2021 crates/uv/src/bin/uv.rs
--error-format=json --json=diagnostic-rendered-ansi,artifacts,future-incompat
--crate-type bin --emit=dep-info,link -C opt-level=3 -C lto=fat '--warn=clippy::pedantic'
'--allow=clippy::used_underscore_binding' --warn=unsafe_code --warn=unreachable_pub
'--allow=clippy::too_many_lines' '--allow=clippy::too_many_arguments'
'--allow=clippy::similar_names' '--warn=clippy::rest_pat_in_fully_bound_structs'
'--warn=clippy::rc_mutex' '--warn=clippy::rc_buffer' '--warn=clippy::print_stdout'
'--warn=clippy::print_stderr' '--allow=clippy::must_use_candidate'
'--allow=clippy::module_name_repetitions' '--allow=clippy::missing_panics_doc'
'--allow=clippy::missing_errors_doc' '--allow=clippy::match_same_arms'
'--allow=clippy::map_unwrap_or' '--allow=clippy::large_stack_arrays'
'--allow=clippy::implicit_hasher' '--allow=clippy::if_not_else' '--warn=clippy::get_unwrap'
'--warn=clippy::exit' '--warn=clippy::empty_structs_with_brackets'
'--warn=clippy::empty_drop' '--warn=clippy::dbg_macro' '--allow=clippy::collapsible_if'
'--allow=clippy::collapsible_else_if' '--allow=clippy::char_lit_as_u8' --cfg
'feature="crates-io"' --cfg 'feature="default"' --cfg 'feature="git"' --cfg
'feature="performance"' --cfg 'feature="performance-memory-allocator"' --cfg
'feature="pypi"' --cfg 'feature="python"' --cfg 'feature="python-managed"'
--cfg 'feature="slow-tests"' --cfg 'feature="test-ecosystem"' --check-cfg
'cfg(docsrs,test)' --check-cfg 'cfg(feature, values("axoupdater", "crates-io",
"default", "git", "performance", "performance-memory-allocator",
"pypi", "python", "python-managed", "python-patch", "self-update",
"slow-tests", "test-ecosystem", "tracing-durations-export"))' -C
metadata=0e616a23ba4a6944 -C extra-filename=-7562798b36e8b039 --out-dir
/usr/src/RPM/BUILD/python3-module-uv-0.6.16/target/release/deps -C strip=symbols
-L dependency=/usr/src/RPM/BUILD/python3-module-uv-0.6.16/target/release/deps --extern
anstream=/usr/src/RPM/BUILD/python3-module-uv-0.6.16/target/release/deps/libanstream-74e5143cca662811.rlib
--extern
anyhow=/usr/src/RPM/BUILD/python3-module-uv-0.6.16/target/release/deps/libanyhow-c06973d918ab9642.rlib
--extern
clap=/usr/src/RPM/BUILD/python3-module-uv-0.6.16/target/release/deps/libclap-c80788c4c1fb3fa7.rlib
--extern
console=/usr/src/RPM/BUILD/python3-module-uv-0.6.16/target/release/deps/libconsole-438e5bc428bbb27f.rlib
--extern
ctrlc=/usr/src/RPM/BUILD/python3-module-uv-0.6.16/target/release/deps/libctrlc-eda6930234bef254.rlib
--extern
dotenvy=/usr/src/RPM/BUILD/python3-module-uv-0.6.16/target/release/deps/libdotenvy-48ea420679154c3f.rlib
--extern
flate2=/usr/src/RPM/BUILD/python3-module-uv-0.6.16/target/release/deps/libflate2-09d5753467045a3f.rlib
--extern
fs_err=/usr/src/RPM/BUILD/python3-module-uv-0.6.16/target/release/deps/libfs_err-6e9e194db9810693.rlib
--extern
futures=/usr/src/RPM/BUILD/python3-module-uv-0.6.16/target/release/deps/libfutures-e1df96999c88520e.rlib
--extern
http=/usr/src/RPM/BUILD/python3-module-uv-0.6.16/target/release/deps/libhttp-5ed0f8e3f9f20aa6.rlib
--extern
indicatif=/usr/src/RPM/BUILD/python3-module-uv-0.6.16/target/release/deps/libindicatif-46ea79e263256edb.rlib
--extern
indoc=/usr/src/RPM/BUILD/python3-module-uv-0.6.16/target/release/deps/libindoc-7c9871ab59fd0d09.so
--extern
itertools=/usr/src/RPM/BUILD/python3-module-uv-0.6.16/target/release/deps/libitertools-733094f20c9379b1.rlib
--extern
jiff=/usr/src/RPM/BUILD/python3-module-uv-0.6.16/target/release/deps/libjiff-13fc8fdfb7757f0e.rlib
--extern
miette=/usr/src/RPM/BUILD/python3-module-uv-0.6.16/target/release/deps/libmiette-4c68da7219b302bc.rlib
--extern
nix=/usr/src/RPM/BUILD/python3-module-uv-0.6.16/target/release/deps/libnix-b5e1a909690aa887.rlib
--extern
owo_colors=/usr/src/RPM/BUILD/python3-module-uv-0.6.16/target/release/deps/libowo_colors-4f9b0bcf97028f58.rlib
--extern
petgraph=/usr/src/RPM/BUILD/python3-module-uv-0.6.16/target/release/deps/libpetgraph-3df4244cee40ca8d.rlib
--extern regex=/usr/src/RPM/BUILD/python3-module-uv-0.6.16/target/release/deps/libregex-1d
hasher-privd: parent: handle_io: idle time limit (3600 seconds) exceeded
radiotray-ng-0.2.8-alt2
-- Detecting CXX compile features - done
Package libidn2 was not found in the pkg-config search path.
Perhaps you should add the directory containing `libidn2.pc'
to the PKG_CONFIG_PATH environment variable
Package 'libidn2', required by 'libcurl', not found
Package libidn2 was not found in the pkg-config search path.
Perhaps you should add the directory containing `libidn2.pc'
to the PKG_CONFIG_PATH environment variable
Package 'libidn2', required by 'libcurl', not found
Package libidn2 was not found in the pkg-config search path.
Perhaps you should add the directory containing `libidn2.pc'
to the PKG_CONFIG_PATH environment variable
Package 'libidn2', required by 'libcurl', not found
Package libidn2 was not found in the pkg-config search path.
Perhaps you should add the directory containing `libidn2.pc'
to the PKG_CONFIG_PATH environment variable
Package 'libidn2', required by 'libcurl', not found
-- Found CURL: /usr/lib64/libcurl.so (found version "8.13.0")
rxclient-1.0.1-alt1
checking for wxWidgets version >= 2.8.0 (--debug=no --unicode=yes --static=no)... no
configure: error: Could not find wxWidgets library
veracrypt-1.26.20-alt1
Precompiling SystemPrecompiled.h
SystemPrecompiled.h:13:10: fatal error: wx/wx.h: No such file or directory
13 | #include <wx/wx.h>
zed-0.184.10-alt1
Compiling zlog_settings v0.1.0 (/usr/src/RPM/BUILD/zed-0.184.10/crates/zlog_settings)
hasher-privd: parent: handle_io: idle time limit (3600 seconds) exceeded
17 error logs REMOVED from the list
clementine-1.4.1.38-alt1.g1fc7fe0e1
fatresize-1.0.3-alt13
gnuplot-1:6.0.2-alt2
java-1.8.0-openjdk-0:1.8.0.452.b09-alt1
libtiff-4.7.0-alt1
liburing-2.9-alt1
lilo-24.2-alt3
perl-Math-MatrixReal-2.13-alt1_10
perl-Net-SIP-0.838-alt1
python3-module-cheroot-10.0.1-alt3
python3-module-easyprocess-1.1-alt2
python3-module-jsonschema-spec-0.2.4-alt1
qemu-9.2.3-alt1
redis-7.2.7-alt1
sysfsutils-2.1.1-alt2
tmux-3.5a-alt1
wxGTK3.0-3.0.5.1-alt5.20240531
Total 319 error logs.
Подробная информация о списке рассылки Sisyphus-cybertalk