[cyber] I: p10-20250330 x86_64 beehive_status: +11 -3 (84)

ALT beekeeper hiver на altlinux.org
Вс Мар 30 19:49:24 MSK 2025


	11 NEW error logs

atlas-3.9.35-alt1.qa1
	make[2]: Leaving directory '/usr/src/RPM/BUILD/ATLAS/BUILD/bin'
	ERROR 845 DURING CACHE EDGE DETECTION!!.
	make[2]: Entering directory '/usr/src/RPM/BUILD/ATLAS/BUILD/bin'
	--
	gcc -V 2>&1  >> bin/INSTALL_LOG/ERROR.LOG
	x86_64-alt-linux-gcc: error: unrecognized command-line option '-V'
	x86_64-alt-linux-gcc: fatal error: no input files
	compilation terminated.
	--
	directory.  Be sure to include this file in any help request.
	cat: ../../CONFIG/error.txt: No such file or directory
	1 ku=20,

automake_1.11-1.11.6-alt9
	checking for upc... no
	configure: error: no Unified Parallel C compiler was found
	+ exit_status=77
	--
	+ exit 77
	1 of 878 tests failed
	(73 tests were not run)

ipmiutil-3.1.3-alt2
	ld: iseltime.o: in function `get_sel_time':
	/usr/src/RPM/BUILD/ipmiutil-3.1.3/util/iseltime.c:125: undefined reference to `ipmi_cmdraw'
	ld: iseltime.o: in function `main':
	/usr/src/RPM/BUILD/ipmiutil-3.1.3/util/iseltime.c:235: undefined reference to
	`print_lan_opt_usage'
	ld: /usr/src/RPM/BUILD/ipmiutil-3.1.3/util/iseltime.c:229: undefined reference to
	`parse_lan_options'
	ld: /usr/src/RPM/BUILD/ipmiutil-3.1.3/util/iseltime.c:239: undefined reference to
	`ipmi_getdeviceid'
	ld: /usr/src/RPM/BUILD/ipmiutil-3.1.3/util/iseltime.c:241: undefined reference to
	`show_outcome'
	ld: /usr/src/RPM/BUILD/ipmiutil-3.1.3/util/iseltime.c:242: undefined reference to
	`ipmi_close_'
	ld: iseltime.o: in function `get_sel_utc':
	/usr/src/RPM/BUILD/ipmiutil-3.1.3/util/iseltime.c:98: undefined reference to `ipmi_cmdraw'
	ld: iseltime.o: in function `main':
	/usr/src/RPM/BUILD/ipmiutil-3.1.3/util/iseltime.c:292: undefined reference to `is_remote'
	ld: /usr/src/RPM/BUILD/ipmiutil-3.1.3/util/iseltime.c:300: undefined reference to
	`ipmi_close_'
	ld: /usr/src/RPM/BUILD/ipmiutil-3.1.3/util/iseltime.c:301: undefined reference to
	`show_outcome'
	ld: /usr/src/RPM/BUILD/ipmiutil-3.1.3/util/iseltime.c:264: undefined reference to
	`ipmi_close_'

libpng16-1.6.37-alt1
	make[3]: Entering directory '/usr/src/RPM/BUILD/libpng16-1.6.37'
	FAIL: tests/pngtest
	make[3]: Leaving directory '/usr/src/RPM/BUILD/libpng16-1.6.37'
	--
	# SKIP:  0
	# XFAIL: 0
	# FAIL:  1
	# XPASS: 0
	# ERROR: 0
	.. contents:: :depth: 2
	FAIL: tests/pngtest
	Testing libpng version 1.6.37
	--
	# SKIP:  0
	# XFAIL: 0
	# FAIL:  1
	# XPASS: 0
	# ERROR: 0
	See ./test-suite.log

litmus-0.14.0-alt1.git.9fbc73d
	checking for a BSD-compatible install... /bin/install -c
	./configure: line 2846: syntax error near unexpected token `0,'
	./configure: line 2846: `NE_REQUIRE_VERSIONS(0, 26 27 28 29 30 31)'

os-autoinst-4.6-alt14
	3:
	3:     #   Failed test 'Exit code appear in log'
	3:     #   at ./t/13-osutils.t line 167.
	--
	3:
	3: #   Failed test 'run_diag'
	3: #   at ./t/13-osutils.t line 190.
	--
	3: ./t/13-osutils.t					 (Wstat: 256 Tests: 9 Failed: 1)
	3:   Failed test:  7
	3:   Non-zero exit status: 1
	--
	test-doc-testapi-spellchecking
	67% tests passed, 1 tests failed out of 3
	Total Test time (real) = 112.29 sec
	The following tests FAILED:
	3 - test-perl-testsuite (Failed)
	--
	Use "--rerun-failed --output-on-failure" to re-run the failed cases verbosely.
	FAILED: CMakeFiles/check-pkg-build
	/usr/src/RPM/BUILD/os-autoinst-4.6/x86_64-alt-linux/CMakeFiles/check-pkg-build
	cd /usr/src/RPM/BUILD/os-autoinst-4.6/x86_64-alt-linux && /usr/bin/ctest -V -E
	test-local-.*

python3-module-websockets-12.0-alt0.p10.1
	raise ValueError("Invalid file descriptor: {}".format(fd))
	ValueError: Invalid file descriptor: -1
	.Exception in thread Thread-496:
	--
	raise ValueError("Invalid file descriptor: {}".format(fd))
	ValueError: Invalid file descriptor: -1
	..................................................................................................................s..............................................................................................................................................................................................................................................................................................................................................................................
	ERROR: test_writing_in_recv_events_fails (tests.sync.test_connection.ClientConnectionTests)
	Error when responding to incoming frames is correctly reported.
	--
	raise self.protocol.close_exc from original_exc
	websockets.exceptions.ConnectionClosedError: no close frame received or sent
	FAIL: test_writing_in_send_context_fails (tests.sync.test_connection.ClientConnectionTests)
	Error when sending outgoing frame is correctly reported.
	--
	self.assertIsInstance(raised.exception.__cause__, BrokenPipeError)
	AssertionError: None is not an instance of <class 'BrokenPipeError'>
	Ran 1297 tests in 3.089s
	FAILED (failures=1, errors=1, skipped=14)
	INFO	 : Command's result: FAILURE
	INFO	 : Command's error: Command '['python3', '-m', 'unittest']' returned non-zero
	exit status 1.

redis-6.2.17-alt1
	[ok]: Test multiple clients can be queued up and unblocked
	[ok]: Test clients with syntax errors will get responses immediately
	[ok]: Test both active and passive expires are skipped during client pause
	--
	0 seconds - unit/cluster
	!!! WARNING The following tests failed:
	*** [err]: Slave is able to detect timeout during handshake in
	tests/integration/replication.tcl

telepathy-haze-0.8.1-alt1
	servicetest.TimeoutError
	FAIL: roster/removed-from-rp-subscribe.py (1)
	Testing roster/subscribe.py ...

vaultwarden-1.32.5-alt1
	Running `rustc --crate-name vaultwarden --edition=2021 src/main.rs --error-format=json
	--json=diagnostic-rendered-ansi,artifacts,future-incompat --crate-type bin
	--emit=dep-info,link -C opt-level=3 -C lto=fat -C codegen-units=1 --deny=unused
	--deny=rust_2021_compatibility --deny=rust_2018_idioms --deny=refining_impl_trait
	--deny=let_underscore --deny=keyword_idents --deny=future_incompatible
	'--deny=clippy::zero_sized_map_values' '--deny=clippy::verbose_file_reads'
	--deny=variant_size_differences '--deny=clippy::unused_self'
	--deny=unused_qualifications --deny=unused_lifetimes --deny=unused_import_braces
	'--deny=clippy::unused_async' --forbid=unsafe_code --deny=unsafe-op-in-unsafe-fn
	'--deny=clippy::unnested_or_patterns' '--deny=clippy::unnecessary_self_imports'
	'--deny=clippy::unnecessary_join' --deny=trivial_numeric_casts
	--deny=trivial_casts '--warn=clippy::todo' '--deny=clippy::string_to_string'
	'--deny=clippy::string_add_assign' --deny=static-mut-refs --deny=single_use_lifetimes
	'--deny=clippy::option_option' --deny=noop_method_call --forbid=non_ascii_idents
	'--deny=clippy::needless_lifetimes' '--deny=clippy::needless_continue'
	'--deny=clippy::mem_forget' '--deny=clippy::match_wildcard_for_single_variants'
	'--deny=clippy::match_on_vec_items' '--deny=clippy::manual_string_new'
	'--deny=clippy::manual_instant_elapsed' '--deny=clippy::manual_assert'
	'--deny=clippy::macro_use_imports' '--deny=clippy::linkedlist'
	'--deny=clippy::iter_on_single_items' '--deny=clippy::iter_on_empty_collections'
	'--deny=clippy::inefficient_to_string' '--deny=clippy::float_cmp_const'
	'--deny=clippy::filter_map_next' '--deny=clippy::equatable_if_let'
	--deny=deprecated_in_future '--warn=clippy::dbg_macro' '--deny=clippy::clone_on_ref_ptr'
	'--deny=clippy::cast_lossless' '--deny=clippy::case_sensitive_file_extension_comparisons'
	--cfg 'feature="mysql"' --cfg 'feature="postgresql"' --cfg 'feature="sqlite"'
	--check-cfg 'cfg(docsrs)' --check-cfg 'cfg(feature, values("enable_mimalloc",
	"enable_syslog", "mysql", "postgresql", "query_logger", "sqlite", "unstable",
	"vendored_openssl"))' -C metadata=74a733fc0ea3f32d -C extra-filename=-74a733fc0ea3f32d
	--out-dir /usr/src/RPM/BUILD/vaultwarden-1.32.5/target/release/deps -L
	dependency=/usr/src/RPM/BUILD/vaultwarden-1.32.5/target/release/deps --extern
	argon2=/usr/src/RPM/BUILD/vaultwarden-1.32.5/target/release/deps/libargon2-750f9e5b69597f6d.rlib
	--extern
	bigdecimal=/usr/src/RPM/BUILD/vaultwarden-1.32.5/target/release/deps/libbigdecimal-34436b18918fb098.rlib
	--extern
	bytes=/usr/src/RPM/BUILD/vaultwarden-1.32.5/target/release/deps/libbytes-c0012545db216b8b.rlib
	--extern
	cached=/usr/src/RPM/BUILD/vaultwarden-1.32.5/target/release/deps/libcached-06dc17fcdf37f039.rlib
	--extern
	chrono=/usr/src/RPM/BUILD/vaultwarden-1.32.5/target/release/deps/libchrono-3eb60966ed333c68.rlib
	--extern
	chrono_tz=/usr/src/RPM/BUILD/vaultwarden-1.32.5/target/release/deps/libchrono_tz-e0a91eda23fb06c1.rlib
	--extern
	cookie=/usr/src/RPM/BUILD/vaultwarden-1.32.5/target/release/deps/libcookie-aa49e987a8ac4db0.rlib
	--extern
	cookie_store=/usr/src/RPM/BUILD/vaultwarden-1.32.5/target/release/deps/libcookie_store-59f9270c43e41d37.rlib
	--extern
	dashmap=/usr/src/RPM/BUILD/vaultwarden-1.32.5/target/release/deps/libdashmap-3c14059d91b93e25.rlib
	--extern
	data_encoding=/usr/src/RPM/BUILD/vaultwarden-1.32.5/target/release/deps/libdata_encoding-d0805c8dec707d6e.rlib
	--extern
	data_url=/usr/src/RPM/BUILD/vaultwarden-1.32.5/target/release/deps/libdata_url-9bea923436ccb479.rlib
	--extern
	diesel=/usr/src/RPM/BUILD/vaultwarden-1.32.5/target/release/deps/libdiesel-eb07c867b481349c.rlib
	--extern
	diesel_migrations=/usr/src/RPM/BUILD/vaultwarden-1.32.5/target/release/deps/libdiesel_migrations-5ac17e4550d2a505.rlib
	--extern
	dotenvy=/usr/src/RPM/BUILD/vaultwarden-1.32.5/target/release/deps/libdotenvy-0a52cbd258b516e9.rlib
	--extern
	email_address=/usr/src/RPM/BUILD/vaultwarden-1.32.5/target/release/deps/libemail_address-a03fbd2168b7302c.rlib
	--extern
	fern=/usr/src/RPM/BUILD/vaultwarden-1.32.5/target/release/deps/libfern-328ba5c6531e0d41.rlib
	--extern futures=/usr
	hasher-privd: parent: handle_io: idle time limit (3600 seconds) exceeded

verilator-4.226-alt1
	x86_64-alt-linux-g++ -pipe -frecord-gcc-switches -Wall -g -O2 -pipe
	-frecord-gcc-switches -Wall -g -O2  -O2 -MMD -I. -I.. -I.. -I../../include
	-I../../include -MP  -faligned-new -Wno-unused-parameter -Wno-shadow -DDEFENV_SYSTEMC=\"\"
	-DDEFENV_SYSTEMC_ARCH=\"\" -DDEFENV_SYSTEMC_INCLUDE=\"\" -DDEFENV_SYSTEMC_LIBDIR=\"\"
	-DDEFENV_VERILATOR_ROOT=\"/usr/share/verilator\" -Wno-char-subscripts -Wno-unused -c
	../V3ParseGrammar.cpp -o V3ParseGrammar.o
	make[2]: Leaving directory '/usr/src/RPM/BUILD/verilator-4.226/src/obj_opt'
	make[2]: Entering directory '/usr/src/RPM/BUILD/verilator-4.226/src/obj_opt'
	Linking ../../bin/verilator_bin...
	x86_64-alt-linux-g++ -static-libgcc -Xlinker -gc-sections -o ../../bin/verilator_bin
	Verilator.o V3Active.o V3ActiveTop.o V3Assert.o V3AssertPre.o V3Ast.o V3AstNodes.o
	V3Begin.o V3Branch.o V3Broken.o V3CCtors.o V3CUse.o V3Case.o V3Cast.o V3Cdc.o V3Changed.o
	V3Class.o V3Clean.o V3Clock.o V3Combine.o V3Common.o V3Config.o V3Const__gen.o
	V3Coverage.o V3CoverageJoin.o V3Dead.o V3Delayed.o V3Depth.o V3DepthBlock.o V3Descope.o
	V3DupFinder.o V3EmitCBase.o V3EmitCConstPool.o V3EmitCFunc.o V3EmitCHeaders.o V3EmitCImp.o
	V3EmitCInlines.o V3EmitCMain.o V3EmitCMake.o V3EmitCModel.o V3EmitCSyms.o V3EmitMk.o
	V3EmitV.o V3EmitXml.o V3Error.o V3Expand.o V3File.o V3FileLine.o V3Force.o V3Gate.o
	V3GenClk.o V3Global.o V3Graph.o V3GraphAlg.o V3GraphAcyc.o V3GraphPathChecker.o
	V3GraphTest.o V3Hash.o V3Hasher.o V3HierBlock.o V3Inline.o V3Inst.o V3InstrCount.o
	V3Life.o V3LifePost.o V3LinkCells.o V3LinkDot.o V3LinkJump.o V3LinkInc.o V3LinkLValue.o
	V3LinkLevel.o V3LinkParse.o V3LinkResolve.o V3Localize.o V3MergeCond.o V3Name.o
	V3Number.o V3OptionParser.o V3Options.o V3Order.o V3Os.o V3Param.o V3Partition.o
	V3PreShell.o V3Premit.o V3ProtectLib.o V3Randomize.o V3Reloop.o V3Scope.o V3Scoreboard.o
	V3Slice.o V3Split.o V3SplitAs.o V3SplitVar.o V3Stats.o V3StatsReport.o V3String.o
	V3Subst.o V3Table.o V3Task.o V3Trace.o V3TraceDecl.o V3Tristate.o V3TSP.o V3Undriven.o
	V3Unknown.o V3Unroll.o V3VariableOrder.o V3Waiver.o V3Width.o V3WidthSel.o  V3ParseImp.o
	V3ParseGrammar.o V3ParseLex.o V3PreProc.o   -lpthread -lm
	make[2]: Leaving directory '/usr/src/RPM/BUILD/verilator-4.226/src/obj_opt'
	make[2]: Entering directory '/usr/src/RPM/BUILD/verilator-4.226/src/obj_dbg'
	Linking ../../bin/verilator_bin_dbg...
	x86_64-alt-linux-g++ -gz -static-libgcc -Xlinker -gc-sections
	-o ../../bin/verilator_bin_dbg Verilator.o V3Active.o V3ActiveTop.o V3Assert.o
	V3AssertPre.o V3Ast.o V3AstNodes.o V3Begin.o V3Branch.o V3Broken.o V3CCtors.o V3CUse.o
	V3Case.o V3Cast.o V3Cdc.o V3Changed.o V3Class.o V3Clean.o V3Clock.o V3Combine.o V3Common.o
	V3Config.o V3Const__gen.o V3Coverage.o V3CoverageJoin.o V3Dead.o V3Delayed.o V3Depth.o
	V3DepthBlock.o V3Descope.o V3DupFinder.o V3EmitCBase.o V3EmitCConstPool.o V3EmitCFunc.o
	V3EmitCHeaders.o V3EmitCImp.o V3EmitCInlines.o V3EmitCMain.o V3EmitCMake.o V3EmitCModel.o
	V3EmitCSyms.o V3EmitMk.o V3EmitV.o V3EmitXml.o V3Error.o V3Expand.o V3File.o V3FileLine.o
	V3Force.o V3Gate.o V3GenClk.o V3Global.o V3Graph.o V3GraphAlg.o V3GraphAcyc.o
	V3GraphPathChecker.o V3GraphTest.o V3Hash.o V3Hasher.o V3HierBlock.o V3Inline.o
	V3Inst.o V3InstrCount.o V3Life.o V3LifePost.o V3LinkCells.o V3LinkDot.o V3LinkJump.o
	V3LinkInc.o V3LinkLValue.o V3LinkLevel.o V3LinkParse.o V3LinkResolve.o V3Localize.o
	V3MergeCond.o V3Name.o V3Number.o V3OptionParser.o V3Options.o V3Order.o V3Os.o V3Param.o
	V3Partition.o V3PreShell.o V3Premit.o V3ProtectLib.o V3Randomize.o V3Reloop.o V3Scope.o
	V3Scoreboard.o V3Slice.o V3Split.o V3SplitAs.o V3SplitVar.o V3Stats.o V3StatsReport.o
	V3String.o V3Subst.o V3Table.o V3Task.o V3Trace.o V3TraceDecl.o V3Tristate.o V3TSP.o
	V3Undriven.o V3Unknown.o V3Unroll.o V3VariableOrder.o V3Waiver.o V3Width.o V3WidthSel.o
	V3ParseImp.o V3ParseGrammar.o V3ParseLex.o V3PreProc.o	 -lpthread -lm
	make[2]: Leaving directory '/usr/src/RPM/BUILD/verilator-4.226/src/obj_dbg'

	3 error logs REMOVED from the list
libgdk-pixbuf-2.42.6-alt1
python3-module-jupyter_client-6.1.7-alt3
python3-module-pyshark-0.6-alt1

Total 84 error logs.


Подробная информация о списке рассылки Sisyphus-cybertalk