[cyber] I: p11-20250330 x86_64 beehive_status: +7 -10 (97)

ALT beekeeper hiver на altlinux.org
Вс Мар 30 08:35:09 MSK 2025


	7 NEW error logs

automake_1.11-1.11.6-alt10
	checking for upc... no
	configure: error: no Unified Parallel C compiler was found
	+ exit_status=77
	--
	+ exit 77
	1 of 878 tests failed
	(73 tests were not run)

cppcheck-2.16.1-alt2
	cd /usr/src/RPM/BUILD/cppcheck-2.16.1/x86_64-alt-linux/lib &&
	/usr/bin/c++ -DFILESDIR=\"/usr/share/Cppcheck\" -DHAVE_RULES
	-I/usr/src/RPM/BUILD/cppcheck-2.16.1/x86_64-alt-linux/lib
	-I/usr/src/RPM/BUILD/cppcheck-2.16.1/lib -I/usr/src/RPM/BUILD/cppcheck-2.16.1/externals
	-I/usr/src/RPM/BUILD/cppcheck-2.16.1/externals/tinyxml2
	-I/usr/src/RPM/BUILD/cppcheck-2.16.1/externals/picojson
	-I/usr/src/RPM/BUILD/cppcheck-2.16.1/externals/simplecpp -isystem /usr/include/pcre
	-pipe -frecord-gcc-switches -Wall -g -O2 -flto=auto -Wno-error=return-type -O2
	-DNDEBUG -std=gnu++11 -O2 -pedantic -Wall -Wextra -Wcast-qual -Wfloat-equal
	-Wmissing-declarations -Wmissing-format-attribute -Wno-long-long -Wpacked
	-Wredundant-decls -Wundef -Wno-missing-field-initializers -Wno-missing-braces
	-Wno-sign-compare -Wno-multichar -Woverloaded-virtual -pipe -Wno-maybe-uninitialized
	-Wsuggest-attribute=noreturn -Wno-shadow -Wuseless-cast -Winvalid-pch -include
	/usr/src/RPM/BUILD/cppcheck-2.16.1/x86_64-alt-linux/lib/CMakeFiles/cppcheck-core.dir/cmake_pch.hxx
	-MD -MT lib/CMakeFiles/cppcheck-core.dir/build/mc_vf_settokenvalue.cpp.o
	-MF CMakeFiles/cppcheck-core.dir/build/mc_vf_settokenvalue.cpp.o.d
	-o CMakeFiles/cppcheck-core.dir/build/mc_vf_settokenvalue.cpp.o -c
	/usr/src/RPM/BUILD/cppcheck-2.16.1/x86_64-alt-linux/lib/build/mc_vf_settokenvalue.cpp
	gmake[2]: Leaving directory '/usr/src/RPM/BUILD/cppcheck-2.16.1/x86_64-alt-linux'
	gmake[2]: Entering directory '/usr/src/RPM/BUILD/cppcheck-2.16.1/x86_64-alt-linux'
	[ 57%] Building CXX object lib/CMakeFiles/cppcheck-core.dir/build/mc_vf_subfunction.cpp.o
	cd /usr/src/RPM/BUILD/cppcheck-2.16.1/x86_64-alt-linux/lib &&
	/usr/bin/c++ -DFILESDIR=\"/usr/share/Cppcheck\" -DHAVE_RULES
	-I/usr/src/RPM/BUILD/cppcheck-2.16.1/x86_64-alt-linux/lib
	-I/usr/src/RPM/BUILD/cppcheck-2.16.1/lib -I/usr/src/RPM/BUILD/cppcheck-2.16.1/externals
	-I/usr/src/RPM/BUILD/cppcheck-2.16.1/externals/tinyxml2
	-I/usr/src/RPM/BUILD/cppcheck-2.16.1/externals/picojson
	-I/usr/src/RPM/BUILD/cppcheck-2.16.1/externals/simplecpp -isystem /usr/include/pcre
	-pipe -frecord-gcc-switches -Wall -g -O2 -flto=auto -Wno-error=return-type -O2
	-DNDEBUG -std=gnu++11 -O2 -pedantic -Wall -Wextra -Wcast-qual -Wfloat-equal
	-Wmissing-declarations -Wmissing-format-attribute -Wno-long-long -Wpacked
	-Wredundant-decls -Wundef -Wno-missing-field-initializers -Wno-missing-braces
	-Wno-sign-compare -Wno-multichar -Woverloaded-virtual -pipe -Wno-maybe-uninitialized
	-Wsuggest-attribute=noreturn -Wno-shadow -Wuseless-cast -Winvalid-pch -include
	/usr/src/RPM/BUILD/cppcheck-2.16.1/x86_64-alt-linux/lib/CMakeFiles/cppcheck-core.dir/cmake_pch.hxx
	-MD -MT lib/CMakeFiles/cppcheck-core.dir/build/mc_vf_subfunction.cpp.o
	-MF CMakeFiles/cppcheck-core.dir/build/mc_vf_subfunction.cpp.o.d
	-o CMakeFiles/cppcheck-core.dir/build/mc_vf_subfunction.cpp.o -c
	/usr/src/RPM/BUILD/cppcheck-2.16.1/x86_64-alt-linux/lib/build/mc_vf_subfunction.cpp
	gmake[2]: Leaving directory '/usr/src/RPM/BUILD/cppcheck-2.16.1/x86_64-alt-linux'
	gmake[1]: Entering directory '/usr/src/RPM/BUILD/cppcheck-2.16.1/x86_64-alt-linux'
	[ 58%] Built target cppcheck-core
	gmake[1]: Leaving directory '/usr/src/RPM/BUILD/cppcheck-2.16.1/x86_64-alt-linux'
	gmake: *** [Makefile:146: all] Error 2

libsecret-0.21.6-alt1
	24/24 libsecret:libsecret / test-service	  OK		 16.93s
	Summary of Failures:
	19/24 libsecret:libsecret / test-collection	  FAIL		  7.22s   (exit status
	133 or signal 5 SIGTRAP)
	Ok:		    23
	Expected Fail:	    0
	Fail:		    1
	Unexpected Pass:    0
	Skipped:	    0
	Timeout:	    0
	Full log written to
	/usr/src/RPM/BUILD/libsecret-0.21.6/x86_64-alt-linux/meson-logs/testlog.txt

python3-module-silx-2.1.0-alt1
	SKIPPED [2] ../../../../lib/python3/site-packages/_pytest/unittest.py:374: Network or
	silx website not available
	FAILED
	.run_venv/lib/python3/site-packages/silx/io/test/test_h5py_utils.py::TestH5pyUtils::test_modes_multi_process
	=========== 1 failed, 1145 passed, 1402 skipped in 118.44s (0:01:58) ===========
	INFO	 : Command's result: FAILURE
	INFO	 : Command's error: Command '['python', 'run_tests.py', '--installed', '-ra',
	'-Wignore', '--low-mem']' returned non-zero exit status 1.
	error: Bad exit status from /usr/src/tmp/rpm-tmp.10209 (%check)

snapd-glib-2-1.66-alt1
	Summary of Failures:
	3/4 Tests		 TIMEOUT	600.14s   killed by signal 15 SIGTERM
	4/4 Tests (qt6		 TIMEOUT	600.13s   killed by signal 15 SIGTERM
	Ok:		    2
	Expected Fail:	    0
	Fail:		    0
	Unexpected Pass:    0
	Skipped:	    0
	Timeout:	    2
	Full log written to
	/usr/src/RPM/BUILD/snapd-glib-1.66/x86_64-alt-linux/meson-logs/testlog.txt

srt-1.5.4-alt1
	[  PASSED  ] 267 tests.
	[  FAILED  ] 1 test, listed below:
	[  FAILED  ] TestFEC.ConnectionFull1
	1 FAILED TEST
	YOU HAVE 6 DISABLED TESTS

vector-0.44.0-alt1
	Compiling rdkafka v0.37.0
	hasher-privd: parent: handle_io: idle time limit (3600 seconds) exceeded

	10 error logs REMOVED from the list
cilk-5.4.6-alt13
gawk-5.1.0.0.213.d04f-alt1
guile22-2.2.7-alt1
openqa-4.6-alt15.1
python-2.7.18-alt11
python3-module-pyshark-0.6-alt2
python3-module-pytest-xdist-3.6.1-alt1
python3-module-taskiq-0.11.3-alt1
python3-module-websockets-12.0-alt1
qemu-9.1.2-alt1

Total 97 error logs.


Подробная информация о списке рассылки Sisyphus-cybertalk