[cyber] I: Sisyphus-20250328 x86_64 beehive_status: +13 -17 (261)
ALT beekeeper
hiver на altlinux.org
Пт Мар 28 09:11:06 MSK 2025
13 NEW error logs
Cardinal-24.12-alt1
ld: ../../carla/build/modules/Release/jackbridge.min.a: error adding symbols: archive
has no index; run ranlib to add one
collect2: error: ld returned 1 exit status
make[2]: *** [../../dpf/Makefile.plugins.mk:557: ../../bin/Cardinal] Error 1
--
ld: ../../carla/build/modules/Release/jackbridge.min.a: error adding symbols: archive
has no index; run ranlib to add one
collect2: error: ld returned 1 exit status
make[2]: *** [../../dpf/Makefile.plugins.mk:600: ../../bin/Cardinal.lv2/Cardinal.so]
Error 1
bpftrace-0.22.1-alt1
[94m[ SKIP ][0m probe.kprobe_offset_module_error (unmet condition: 'lsmod | grep
'^nf_tables'')
[91m[ FAILED ][0m 1 tests, listed below:
[91m[ TIMEOUT ][0m variable.variable declaration not initialized
cosmic-applets-1.0.0-alt0.60.alpha.6
Compiling cosmic-applets v0.1.1
(/usr/src/RPM/BUILD/cosmic-applets-epoch-1.0.0-alpha.6/cosmic-applets)
hasher-privd: parent: handle_io: idle time limit (3600 seconds) exceeded
gawk-5.1.0.0.213.d04f-alt1
make[3]: Entering directory '/usr/src/RPM/BUILD/gawk-5.1.0.0.213.d04f-alt1/test'
1 TESTS FAILED
make[3]: *** [Makefile:5248: pass-fail] Error 1
java-1.8.0-openjdk-0:1.8.0.442.b06-alt1_1jpp8
RPM build errors:
Unparseable macro: % by %%)
Macro %z not found
ignored self-provides: java-1.8.0-openjdk = 0:1.8.0.442.b06-alt1_1jpp8
ignored self-provides: java-1.8.0-openjdk-headless = 0:1.8.0.442.b06-alt1_1jpp8
ignored self-provides: java-1.8.0-openjdk-devel = 0:1.8.0.442.b06
ignored self-provides: java-1.8.0-openjdk-demo = 0:1.8.0.442.b06-alt1_1jpp8
ignored self-provides: java-1.8.0-openjdk-src = 0:1.8.0.442.b06-alt1_1jpp8
ignored self-provides: java-1.8.0-openjdk-javadoc = 0:1.8.0.442.b06-alt1_1jpp8
Unparseable macro: %.*}"
mumps-5.3.5-alt3
gcc -shared graph.o gbipart.o gbisect.o ddcreate.o ddbisect.o nestdiss.o
multisector.o gelim.o bucket.o tree.o symbfac.o interface.o sort.o minpriority.o
-Wl,-soname,libpord_seq-5.3.so -o libpord_seq-5.3.so -fopenmp -lrt -Wl,-z,defs
lto1: internal compiler error: resolution sub id 0x8450e9aff5319b94 not in object file
libbacktrace could not find executable to open
--
See <http://bugzilla.altlinux.org> for instructions.
lto-wrapper: fatal error: x86_64-alt-linux-gcc returned 1 exit status
compilation terminated.
ld: error: lto-wrapper failed
collect2: error: ld returned 1 exit status
make[2]: *** [Makefile:34: libpord_seq.so] Error 1
ocaml-lsp-1.22.0-alt1
+ detached: /-----------------------------------------------------------------------
+ | Internal error: Uncaught exception.
+ | ("fd closed unflushed",
python3-module-anyio-4.8.0-alt2
SKIPPED [4] tests/test_to_interpreter.py:49: requires Python 3.13+
FAILED tests/test_pytest_plugin.py::test_keyboardinterrupt_during_test[asyncio]
= 1 failed, 1534 passed, 49 skipped, 212 deselected, 83 xfailed, 547 xpassed in 169.54s
(0:02:49) =
INFO : Command's result: FAILURE
INFO : Command's error: Command '['python3', '-m', 'pytest', '-Wignore', '-m',
'not network']' returned non-zero exit status 1.
python3-module-hypothesis-6.130.0-alt1
XPASS
tests/datetime/test_zoneinfo_timezones.py::test_can_generate_prefixes_if_allowed_and_available
- newly failing on GitHub Actions
FAILED tests/redis/test_redis_exampledatabase.py::test_redis_listener - hypot...
= 1 failed, 7022 passed, 18 skipped, 6 xfailed, 1 xpassed in 222.71s (0:03:42) =
INFO : Command's result: FAILURE
INFO : Command's error: Command '['python3', '-m', 'pytest', '-ra',
'-nauto', '-Wignore::UserWarning:dateutil.zoneinfo', '--ignore=tests/crosshair',
'--ignore=tests/watchdog', 'tests']' returned non-zero exit status 1.
python3-module-hypothesis-jsonschema-0.23.1-alt1
assert make_validator(schema).is_valid(value)
E AssertionError: assert False
E + where False = is_valid(-9007199254741149)
--
=========================== short test summary info ============================
FAILED tests/test_from_schema.py::test_generated_data_matches_schema[integer-schema]
= 1 failed, 860 passed, 59 skipped, 109 xfailed, 2 xpassed in 572.19s (0:09:32) =
INFO : Command's result: FAILURE
INFO : Command's error: Command '['python3', '-m', 'pytest', '-n', 'auto']' returned
non-zero exit status 1.
vaultwarden-1.33.2-alt2
Running `rustc --crate-name vaultwarden --edition=2021 src/main.rs --error-format=json
--json=diagnostic-rendered-ansi,artifacts,future-incompat --crate-type bin
--emit=dep-info,link -C opt-level=3 -C lto=fat -C codegen-units=1 --deny=unused
--deny=rust_2024_compatibility --deny=rust_2021_compatibility --deny=rust_2018_idioms
--deny=refining_impl_trait --deny=let_underscore --deny=keyword_idents
--deny=future_incompatible '--deny=clippy::zero_sized_map_values'
'--deny=clippy::verbose_file_reads' --deny=variant_size_differences
'--deny=clippy::unused_self' --deny=unused_qualifications --deny=unused_lifetimes
--deny=unused_import_braces '--deny=clippy::unused_async' --forbid=unsafe_code
'--deny=clippy::unnested_or_patterns' '--deny=clippy::unnecessary_self_imports'
'--deny=clippy::unnecessary_join' --deny=trivial_numeric_casts --deny=trivial_casts
'--warn=clippy::todo' --allow=tail_expr_drop_order '--deny=clippy::string_to_string'
'--deny=clippy::string_add_assign' --deny=single_use_lifetimes
'--deny=clippy::option_option' --deny=noop_method_call --forbid=non_ascii_idents
'--deny=clippy::needless_lifetimes' '--deny=clippy::needless_continue'
'--deny=clippy::mem_forget' '--deny=clippy::match_wildcard_for_single_variants'
'--deny=clippy::match_on_vec_items' '--deny=clippy::manual_string_new'
'--deny=clippy::manual_instant_elapsed' '--deny=clippy::manual_assert'
'--deny=clippy::macro_use_imports' '--deny=clippy::linkedlist'
'--deny=clippy::iter_on_single_items' '--deny=clippy::iter_on_empty_collections'
'--deny=clippy::inefficient_to_string' --allow=if_let_rescope
'--deny=clippy::float_cmp_const' '--deny=clippy::filter_map_next'
'--deny=clippy::equatable_if_let' --allow=edition_2024_expr_fragment_specifier
--deny=deprecated_in_future '--warn=clippy::dbg_macro' '--deny=clippy::clone_on_ref_ptr'
'--deny=clippy::cast_lossless' '--deny=clippy::case_sensitive_file_extension_comparisons'
--cfg 'feature="mysql"' --cfg 'feature="postgresql"' --cfg 'feature="sqlite"'
--check-cfg 'cfg(docsrs,test)' --check-cfg 'cfg(feature, values("enable_mimalloc",
"enable_syslog", "mysql", "postgresql", "query_logger", "sqlite", "unstable",
"vendored_openssl"))' -C metadata=1136bb61b25f3967 -C extra-filename=-39d222e090232768
--out-dir /usr/src/RPM/BUILD/vaultwarden-1.33.2/target/release/deps -L
dependency=/usr/src/RPM/BUILD/vaultwarden-1.33.2/target/release/deps --extern
argon2=/usr/src/RPM/BUILD/vaultwarden-1.33.2/target/release/deps/libargon2-03b98df41eec29be.rlib
--extern
bigdecimal=/usr/src/RPM/BUILD/vaultwarden-1.33.2/target/release/deps/libbigdecimal-ee80d000ff042124.rlib
--extern
bytes=/usr/src/RPM/BUILD/vaultwarden-1.33.2/target/release/deps/libbytes-8187ae8008647f7b.rlib
--extern
cached=/usr/src/RPM/BUILD/vaultwarden-1.33.2/target/release/deps/libcached-e2b1557fe78010c9.rlib
--extern
chrono=/usr/src/RPM/BUILD/vaultwarden-1.33.2/target/release/deps/libchrono-af284a1ae76a3a33.rlib
--extern
chrono_tz=/usr/src/RPM/BUILD/vaultwarden-1.33.2/target/release/deps/libchrono_tz-4a210a62d9eef871.rlib
--extern
cookie=/usr/src/RPM/BUILD/vaultwarden-1.33.2/target/release/deps/libcookie-a595c0feb2ae57d8.rlib
--extern
cookie_store=/usr/src/RPM/BUILD/vaultwarden-1.33.2/target/release/deps/libcookie_store-8e43f0e507ec79c8.rlib
--extern
dashmap=/usr/src/RPM/BUILD/vaultwarden-1.33.2/target/release/deps/libdashmap-62e0dd1ff026e690.rlib
--extern
data_encoding=/usr/src/RPM/BUILD/vaultwarden-1.33.2/target/release/deps/libdata_encoding-7ee30f85b757ecb4.rlib
--extern
data_url=/usr/src/RPM/BUILD/vaultwarden-1.33.2/target/release/deps/libdata_url-20eaeba5cb9b3e43.rlib
--extern
derive_more=/usr/src/RPM/BUILD/vaultwarden-1.33.2/target/release/deps/libderive_more-50bc8fe1be3e6dbd.rlib
--extern
diesel=/usr/src/RPM/BUILD/vaultwarden-1.33.2/target/release/deps/libdiesel-43d5b34248c55b41.rlib
--extern
diesel_derive_newtype=/usr/src/RPM/BUILD/vaultwarden-1.33.2/target/release/deps/libdiesel_derive_newtype-d57e3071f790d6c9.so
--extern
diesel_migrations=/usr/src/RPM/BUILD/vaultwarden-1.33.2/target/release/deps/libdiesel_migrations-643a988dc469333b.rlib
--extern dotenvy=/usr
hasher-privd: parent: handle_io: idle time limit (3600 seconds) exceeded
zeromq-4.3.4-alt3
./config/test-driver: line 112: 3640007 Aborted "$@" >> "$log_file" 2>&1
FAIL: tests/test_inproc_connect
PASS: tests/test_issue_566
--
# SKIP: 19
# XFAIL: 0
# FAIL: 1
# XPASS: 0
# ERROR: 0
See ./test-suite.log
zig-0.13.0-alt1
/usr/bin/gmake -f CMakeFiles/stage3.dir/build.make CMakeFiles/stage3.dir/build
hasher-privd: parent: handle_io: idle time limit (3600 seconds) exceeded
17 error logs REMOVED from the list
blender4.4-4.4.0-alt4
expect-1:5.45.4-alt4
festival-2.5-alt0.4
fwupd-2.0.6-alt1
gcr4-4.4.0.1-alt1
gnuplot-1:6.0.2-alt2
guile22-2.2.7-alt1
hypridle-0.1.2-alt2
ktechlab-0.51.0-alt2.1
ocaml-5.3.0-alt2
python3-module-chameleon.core-4.6.0-alt1
python3-module-numdifftools-0.9.41-alt3
python3-module-pycall-2.3.0-alt2
python3-module-pyshark-0.6-alt2
python3-module-pyvfs-0.2.10-alt2
scummvm-2.8.0-alt1
waked-0.1.1-alt2
Total 261 error logs.
Подробная информация о списке рассылки Sisyphus-cybertalk