[cyber] I: Sisyphus-20250326 x86_64 beehive_status: +13 -19 (270)

ALT beekeeper hiver на altlinux.org
Ср Мар 26 09:23:04 MSK 2025


	13 NEW error logs

dm-secdel-1.0.11-alt2
	systemctl daemon-reload
	make: systemctl: No such file or directory
	make: [Makefile:24: install-bin] Error 127 (ignored)
	systemctl enable secdeltab
	make: systemctl: No such file or directory
	make: [Makefile:25: install-bin] Error 127 (ignored)

guile22-2.2.7-alt1
	make[2]: Leaving directory '/usr/src/RPM/BUILD/guile22-2.2.7/bootstrap'
	hasher-privd: parent: handle_io: idle time limit (3600 seconds) exceeded

hypridle-0.1.2-alt2
	-- Checking for modules 'wayland-client;wayland-protocols;hyprlang>=0.4.0;sdbus-c++'
	--   No package 'sdbus-c++' found
	CMake Error at /usr/share/cmake/Modules/FindPkgConfig.cmake:645 (message):

java-1.8.0-openjdk-0:1.8.0.442.b06-alt1_1jpp8
	RPM build errors:
	Unparseable macro: % by %%)
	Macro %z not found
	ignored self-provides: java-1.8.0-openjdk = 0:1.8.0.442.b06-alt1_1jpp8
	ignored self-provides: java-1.8.0-openjdk-headless = 0:1.8.0.442.b06-alt1_1jpp8
	ignored self-provides: java-1.8.0-openjdk-devel = 0:1.8.0.442.b06
	ignored self-provides: java-1.8.0-openjdk-demo = 0:1.8.0.442.b06-alt1_1jpp8
	ignored self-provides: java-1.8.0-openjdk-src = 0:1.8.0.442.b06-alt1_1jpp8
	ignored self-provides: java-1.8.0-openjdk-javadoc = 0:1.8.0.442.b06-alt1_1jpp8
	Unparseable macro: %.*}"

ldns-1.8.4-alt1
	./libtool --tag=CC --quiet --mode=compile x86_64-alt-linux-gcc -I. -I.	-DHAVE_CONFIG_H
	-DLDNS_TRUST_ANCHOR_FILE="\"/etc/unbound/root.key\"" -DOPENSSL_API_COMPAT=10100
	-fno-strict-aliasing -Wunused-function -Wstrict-prototypes -Wwrite-strings -W -Wall -pipe
	-frecord-gcc-switches -Wall -g -O2 -flto=auto -D_FILE_OFFSET_BITS=64 -D_GNU_SOURCE  -c
	examples/ldns-test-edns.c -o examples/ldns-test-edns.o
	mv: cannot stat 'examples/ldns-test-edns.loT': No such file or directory
	make: Leaving directory '/usr/src/RPM/BUILD/ldns-1.8.4'
	--
	./libtool --tag=CC --quiet --mode=compile x86_64-alt-linux-gcc -I. -I.	-DHAVE_CONFIG_H
	-DLDNS_TRUST_ANCHOR_FILE="\"/etc/unbound/root.key\"" -DOPENSSL_API_COMPAT=10100
	-fno-strict-aliasing -Wunused-function -Wstrict-prototypes -Wwrite-strings -W -Wall -pipe
	-frecord-gcc-switches -Wall -g -O2 -flto=auto -D_FILE_OFFSET_BITS=64 -D_GNU_SOURCE  -c
	./examples/ldns-zsplit.c -o examples/ldns-zsplit.lo
	mv: cannot stat 'examples/ldns-zsplit.loT': No such file or directory
	make: Leaving directory '/usr/src/RPM/BUILD/ldns-1.8.4'
	--
	./libtool --tag=CC --quiet --mode=compile x86_64-alt-linux-gcc -I. -I.	-DHAVE_CONFIG_H
	-DLDNS_TRUST_ANCHOR_FILE="\"/etc/unbound/root.key\"" -DOPENSSL_API_COMPAT=10100
	-fno-strict-aliasing -Wunused-function -Wstrict-prototypes -Wwrite-strings -W -Wall -pipe
	-frecord-gcc-switches -Wall -g -O2 -flto=auto -D_FILE_OFFSET_BITS=64 -D_GNU_SOURCE  -c
	./examples/ldns-dane.c -o examples/ldns-dane.lo
	mv: cannot stat 'examples/ldns-dane.loT': No such file or directory
	make: Leaving directory '/usr/src/RPM/BUILD/ldns-1.8.4'
	--
	ld: /usr/src/tmp/ccrzmfG1.debug.temp.o: error adding symbols: file format not recognized
	collect2: error: ld returned 1 exit status
	make: *** [Makefile:218: examples/ldns-dane] Error 1

libgupnp-igd-1.6.0-alt1
	1/1 gupnp-simple-igd FAIL	     4.05s   killed by signal 5 SIGTRAP
	Summary of Failures:
	1/1 gupnp-simple-igd FAIL	     4.05s   killed by signal 5 SIGTRAP
	Ok:		    0
	Expected Fail:	    0
	Fail:		    1
	Unexpected Pass:    0
	Skipped:	    0
	Timeout:	    0
	Full log written to
	/usr/src/RPM/BUILD/gupnp-igd-1.6.0/x86_64-alt-linux/meson-logs/testlog.txt

liboqs-0.12.0-alt1
	tests/test_constant_time.py::test_constant_time_kem[Kyber768]
	[gw7] [ 97%] SKIPPED tests/test_constant_time.py::test_constant_time_kem[Kyber768]
	tests/test_constant_time.py::test_constant_time_kem[Kyber1024]
	[gw7] [ 97%] SKIPPED tests/test_constant_time.py::test_constant_time_kem[Kyber1024]
	[gw2] [ 97%] PASSED tests/test_hash.py::test_hash_sha2_random[sha384]
	tests/test_hash.py::test_hash_sha2_random[sha512]
	[gw2] [ 97%] PASSED tests/test_hash.py::test_hash_sha2_random[sha512]
	tests/test_hash.py::test_hash_sha2_random[sha3_256]
	[gw2] [ 98%] PASSED tests/test_hash.py::test_hash_sha2_random[sha3_256]
	tests/test_hash.py::test_hash_sha2_random[sha3_384] ninja: build stopped: interrupted
	by user.

llama-swap-92-alt1
	Error Trace:	/usr/src/RPM/BUILD/llama-swap-92/proxy/process_test.go:221
	Error:		Not equal:
	expected: "12345"
	--
	!!! Info - Stop() err: invalid state transition from stopped to stopping
	--- FAIL: TestProcess_HTTPRequestsHaveTimeToFinish (1.26s)
	=== RUN   TestSetState

mumps-5.3.5-alt3
	/usr/lib64/openmpi/bin/mpicc -shared graph.o gbipart.o gbisect.o ddcreate.o ddbisect.o
	nestdiss.o multisector.o gelim.o bucket.o tree.o symbfac.o interface.o sort.o minpriority.o
	-Wl,-soname,libpord-5.3.so -o libpord-5.3.so -Wl,--as-needed,-rpath,/usr/lib64/openmpi/lib
	-L/usr/lib64/openmpi/lib -Wl,-z,defs
	lto1: internal compiler error: resolution sub id 0x268eab054ff44d26 not in object file
	libbacktrace could not find executable to open
	--
	See <http://bugzilla.altlinux.org> for instructions.
	lto-wrapper: fatal error: x86_64-alt-linux-gcc returned 1 exit status
	compilation terminated.
	ld: error: lto-wrapper failed
	collect2: error: ld returned 1 exit status
	make[2]: *** [Makefile:34: libpord.so] Error 1

ocaml-5.3.0-alt2
	31 tests skipped
	1 tests failed
	0 tests not started (parent test skipped or failed)

perl-XML-Parser-2.47-alt1
	t/partial.t	    (Wstat: 0 Tests: 3 Failed: 1)
	Failed test:  3
	Files=15, Tests=140,  2 wallclock secs ( 0.05 usr  0.02 sys +  0.75 cusr  0.13 csys =
	0.95 CPU)
	Result: FAIL
	Failed 1/15 test programs. 1/140 subtests failed.
	make: *** [Makefile:904: test_dynamic] Error 255

python3-module-cheroot-10.0.1-alt3
	>	    assert col in needed_collectors, "previous item was not torn down properly"
	E	    AssertionError: previous item was not torn down properly
	col	   = <Module test_server.py>
	--
	/usr/lib/python3/site-packages/_pytest/runner.py:505: AssertionError
	________ ERROR at setup of test_http_over_https_error[0.0.0.0-builtin] _________
	[gw0] linux -- Python 3.12.9
	/usr/src/RPM/BUILD/python3-module-cheroot-10.0.1/.run_venv/bin/python3
	--
	>	    assert col in needed_collectors, "previous item was not torn down properly"
	E	    AssertionError: previous item was not torn down properly
	col	   = <Module test_server.py>
	--
	XFAIL cheroot/test/test_core.py::test_large_request -
	https://github.com/cherrypy/cheroot/issues/106
	ERROR cheroot/test/test_ssl.py::test_http_over_https_error[0.0.0.0-pyopenssl]
	ERROR cheroot/test/test_ssl.py::test_http_over_https_error[0.0.0.0-builtin]
	================== 151 passed, 3 xfailed, 2 errors in 17.22s ===================
	INFO	 : Command's result: FAILURE
	INFO	 : Command's error: Command '['python3', '-m', 'pytest', '-k', 'not
	test_tls_client_auth']' returned non-zero exit status 1.

rccl-2.18.6-alt0.1
	cmake is already the newest version.
	E: Version ='6.1.2' for 'rocm-cmake' was not found
	hsh-install: Failed to calculate package file list.

	19 error logs REMOVED from the list
Cardinal-24.12-alt1
auditd-plugin-clickhouse-lite-0.1.8-alt2
cppcheck-2.16.2-alt1_1_1f61c2e8d
faces-1.7.7-alt7
kicad-1:8.0.8-alt1
kvmtool-3.18.0-alt7
libgda6-6.0.0-alt2
netbox-4.2.2-alt1
node-uglify-js-3.17.0-alt1
perl-Imager-1.012-alt1
python-2.7.18-alt11
python3-module-eventlet-0.39.1-alt1
python3-module-fastapi-0.115.11-alt1
python3-module-mkdocs-1.6.1-alt1
python3-module-pygeoif-1.5.1-alt1
python3-module-sanic-24.6.0-alt2
python3-module-sphinxcontrib-programoutput-0.17-alt2
python3-module-textdistance-4.6.3-alt1
python3-module-tpm2-pytss-2.2.1-alt1

Total 270 error logs.


Подробная информация о списке рассылки Sisyphus-cybertalk