[cyber] I: Sisyphus-20250322 x86_64 beehive_status: +4 -17 (276)
ALT beekeeper
hiver на altlinux.org
Сб Мар 22 09:05:08 MSK 2025
4 NEW error logs
auditd-plugin-clickhouse-lite-0.1.8-alt2
ok 1 auditd-plugin-clickhouse min-bench
hasher-privd: parent: handle_io: idle time limit (3600 seconds) exceeded
python3-module-sanic-24.6.0-alt2
=========================== short test summary info ============================
FAILED tests/test_cli.py::test_server_run_with_repl - EOFError: Ran out of input
FAILED tests/test_reloader.py::test_reload_listeners - RuntimeError: generato...
= 2 failed, 1666 passed, 25 skipped, 5 deselected, 3 xfailed, 6 xpassed, 297 warnings
in 236.51s (0:03:56) =
INFO : Command's result: FAILURE
INFO : Command's error: Command '['python3', '-m', 'pytest', '-k', 'not
test_websocket_route_with_subprotocols and not test_keep_alive_client_timeout']'
returned non-zero exit status 1.
sssd-2.9.6-alt3
PASS: test_ad_subdom
FAIL: test_ipa_subdom_server
PASS: test_sssd_krb5_localauth_plugin
--
# SKIP: 2
# XFAIL: 0
# FAIL: 1
# XPASS: 0
# ERROR: 0
.. contents:: :depth: 2
FAIL: test_ipa_subdom_server
[==========] tests: Running 13 test(s).
--
[sssd] [sss_sssd_user_uid_and_gid] (0x0020): failed to get sssd user (_sssd) uid/gid,
using root
[ ERROR ] --- test_ctx->ipa_ctx->server_mode->trusts
[ LINE ] --- src/tests/cmocka/test_ipa_subdomains_server.c:552: error: Failure!
[ FAILED ] test_ipa_server_trust_init
[ RUN ] test_ipa_server_create_trusts
--
[ PASSED ] 12 test(s).
[ FAILED ] tests: 1 test(s), listed below:
[ FAILED ] test_ipa_server_trust_init
1 FAILED TEST(S)
zstd-1.5.5-alt2
test206 : ZSTD_adjustCParams() + dictionary OK
test207 : check compression mem usage monotonicity over levels for estimateCCtxSize() : OK
test208 : check estimateCCtxSize() always larger or equal to
ZSTD_estimateCCtxSize_usingCParams() : OK
test209 : thread pool API tests :
thread pool test : threadPool re-use roundtrips: OK
thread pool test : threadPool simultaneous usage: OK
thread pool tests OK
1
4
15
21
30
32
45
66
75
91
97
121
134
140
150
181
193
195
209
223
234
236
247
252
259
260
262
272
284
287
301
308
322
328
337
352
367
368
385
395
400
415
428
438
443
453
455
463
467
471
481
486
491
500
511
512
520
523
527
533
536
545
553
571
584
594
607
610
639
648
651
659
665
671
673
689
699
704
716
725
741
747
764
774
780
799
804
820
830
840
846
856
865
891
904
920
936
948
973
982
983
996
1005
1008
1025
1046
1066
1081
1087
1094
1108
1119
1126
1134
1136
1140
1148
1160
1169
1175
1185
1194
1211
1214
1219
1231
1242
1259
1273
1287
1299
1317
1341
1366
1384
1398
1406
1423
1440
1441
1444
1455
1459
1471
1489
1515
1526
1528
1532
1548
1561
1578
1588
1599
1610
1626
1644
1658
1663
1669
1671
1677
1681
1688
1696
1700
1712
1719
1726
1727
1732
1749
1752
1760
1770
1796
1804
1805
1815
1820
1839
1843
1851
1879
1891
1902
1927
1938
1952
1961
1962
1968
1971
1975
1977
1989
2004
2014
2025
2027
2034
2041
2052
2072
2085
2101
2106
2117
2132
2143
2148
2159
2167
2176
2199
2202
2220
2226
2230
2246
2263
2266
2287
2297
2316
2328
2336
2352
2373
2379
2388
2394
2420
2437
2453
2458
2461
2470
2489
2492
2508
make: Leaving directory '/usr/src/RPM/BUILD/zstd-1.5.5-alt2/tests'
make: Target 'test' not remade because of errors.
17 error logs REMOVED from the list
dm-secdel-1.0.11-alt2
dropbear-2025.87-alt1
dvdauthor-0.7.2-alt4
fractal-7-alt1
kopia-0.19.0-alt1
libgdiplus-5.6.1-alt1
libliftoff-0.5.0-alt1
ollama-0.6.0-alt1
protobuf-3.25.5-alt6
python-2.7.18-alt11
python3-module-backrefs-5.8-alt1
python3-module-easyprocess-1.1-alt2
python3-module-hypothesis-jsonschema-0.23.1-alt1
python3-module-textdistance-4.6.3-alt1
python3-module-websockets-14.1-alt1
srt-1.5.4-alt2
tmux-3.5a-alt1
Total 276 error logs.
Подробная информация о списке рассылки Sisyphus-cybertalk