[cyber] I: Sisyphus-20250317 x86_64 beehive_status: +13 -14 (294)

ALT beekeeper hiver на altlinux.org
Пн Мар 17 08:37:53 MSK 2025


	13 NEW error logs

altlinux-freedesktop-menu-0.70-alt1
	+ j=altlinux-webdevelopment.directory
	+ grep altlinux-webdevelopment.directory ignore.list
	+ grep 'Name\[ru\]=' desktop-directories/altlinux-webdevelopment.directory
	+ for i in desktop-directories/*.directory
	++ basename desktop-directories/altlinux-xfce.directory
	+ j=altlinux-xfce.directory
	+ grep altlinux-xfce.directory ignore.list
	+ rm ignore.list
	+ '[' 0 -gt 0 ']'
	+ exit 1

dopewars-1.5.12-alt2_20.1033svn
	ranlib: .libs/libsound_sdl.a(sound_sdl.o): plugin needed to handle lto object
	ranlib: unable to copy file '.libs/libsound_sdl.a'; reason: No such file or directory
	make[3]: *** [Makefile:430: libsound_sdl.la] Error 1

dropbear-2025.87-alt1
	>	self.socket.bind(self.server_address)
	E	OSError: [Errno 98] Address already in use
	/usr/lib64/python3.12/socketserver.py:478: OSError
	--
	[231] Mar 17 04:59:08 Pubkey auth succeeded for 'root' with ecdsa-sha2-nistp256 key
	SHA256:wBRzLm/WPmgVoIx5rCk23Ngr/d4f3ARTzrm9Ng4cqEQ from 127.0.0.1:60702
	[232] Mar 17 04:59:08 lastlog_perform_login: Couldn't stat /var/log/lastlog: No such
	file or directory
	[232] Mar 17 04:59:08 lastlog_openseek: /var/log/lastlog is not a file or directory!
	[231] Mar 17 04:59:08 Exit (root) from <127.0.0.1:60702>: Exited normally
	[231] Mar 17 04:59:08 syslogin_perform_logout: logout(pts/1) returned an error: No such
	file or directory
	[235] Mar 17 04:59:08 Child connection from 127.0.0.1:60704
	--
	[240] Mar 17 04:59:08 Pubkey auth succeeded for 'root' with ecdsa-sha2-nistp256 key
	SHA256:wBRzLm/WPmgVoIx5rCk23Ngr/d4f3ARTzrm9Ng4cqEQ from 127.0.0.1:60720
	[241] Mar 17 04:59:08 lastlog_perform_login: Couldn't stat /var/log/lastlog: No such
	file or directory
	[241] Mar 17 04:59:08 lastlog_openseek: /var/log/lastlog is not a file or directory!
	[240] Mar 17 04:59:08 Exit (root) from <127.0.0.1:60720>: Exited normally
	[240] Mar 17 04:59:08 syslogin_perform_logout: logout(pts/2) returned an error: No such
	file or directory
	[244] Mar 17 04:59:08 Child connection from 127.0.0.1:60728
	--
	[249] Mar 17 04:59:08 Pubkey auth succeeded for 'root' with ecdsa-sha2-nistp256 key
	SHA256:wBRzLm/WPmgVoIx5rCk23Ngr/d4f3ARTzrm9Ng4cqEQ from 127.0.0.1:60732
	[250] Mar 17 04:59:08 lastlog_perform_login: Couldn't stat /var/log/lastlog: No such
	file or directory
	[250] Mar 17 04:59:08 lastlog_openseek: /var/log/lastlog is not a file or directory!
	[249] Mar 17 04:59:08 Exit (root) from <127.0.0.1:60732>: Exited normally
	[249] Mar 17 04:59:08 syslogin_perform_logout: logout(pts/3) returned an error: No such
	file or directory
	[253] Mar 17 04:59:08 Child connection from 127.0.0.1:60742
	--
	[258] Mar 17 04:59:09 Pubkey auth succeeded for 'root' with ecdsa-sha2-nistp256 key
	SHA256:wBRzLm/WPmgVoIx5rCk23Ngr/d4f3ARTzrm9Ng4cqEQ from 127.0.0.1:60752
	[259] Mar 17 04:59:09 lastlog_perform_login: Couldn't stat /var/log/lastlog: No such
	file or directory
	[259] Mar 17 04:59:09 lastlog_openseek: /var/log/lastlog is not a file or directory!
	[258] Mar 17 04:59:09 Exit (root) from <127.0.0.1:60752>: Exited normally
	[258] Mar 17 04:59:09 syslogin_perform_logout: logout(pts/4) returned an error: No such
	file or directory
	[262] Mar 17 04:59:09 Child connection from 127.0.0.1:60760
	--
	[267] Mar 17 04:59:09 Pubkey auth succeeded for 'root' with ecdsa-sha2-nistp256 key
	SHA256:wBRzLm/WPmgVoIx5rCk23Ngr/d4f3ARTzrm9Ng4cqEQ from 127.0.0.1:60776
	[268] Mar 17 04:59:09 lastlog_perform_login: Couldn't stat /var/log/lastlog: No such
	file or directory
	[268] Mar 17 04:59:09 lastlog_openseek: /var/log/lastlog is not a file or directory!

event-driven-servers-1.0-alt4
	ld: mavistest.o: in function `myparse':
	/usr/src/RPM/BUILD/event-driven-servers-1.0/mavis/mavistest.c:53:(.text+0x5c): undefined
	reference to `sym_get'
	ld: /usr/src/RPM/BUILD/event-driven-servers-1.0/mavis/mavistest.c:56:(.text+0x7c):
	undefined reference to `sym_get'
	ld: /usr/src/RPM/BUILD/event-driven-servers-1.0/mavis/mavistest.c:66:(.text+0xa6):
	undefined reference to `parse_error'
	ld: /usr/src/RPM/BUILD/event-driven-servers-1.0/mavis/mavistest.c:70:(.text+0xae):
	undefined reference to `sym_get'
	ld: /usr/src/RPM/BUILD/event-driven-servers-1.0/mavis/mavistest.c:70:(.text+0xc6):
	undefined reference to `sym_get'
	ld: /usr/src/RPM/BUILD/event-driven-servers-1.0/mavis/mavistest.c:38:(.text+0xe3):
	undefined reference to `parse_common'
	ld: /usr/src/RPM/BUILD/event-driven-servers-1.0/mavis/mavistest.c:40:(.text+0xfc):
	undefined reference to `sym_get'
	ld: /usr/src/RPM/BUILD/event-driven-servers-1.0/mavis/mavistest.c:43:(.text+0x123):
	undefined reference to `parse_mavismodule'
	ld: /usr/src/RPM/BUILD/event-driven-servers-1.0/mavis/mavistest.c:46:(.text+0x174):
	undefined reference to `parse_mavispath'
	ld: mavistest.o: in function `main':
	/usr/src/RPM/BUILD/event-driven-servers-1.0/mavis/mavistest.c:100:(.text.startup+0x49):
	undefined reference to `init_common_data'
	ld: /usr/src/RPM/BUILD/event-driven-servers-1.0/mavis/mavistest.c:114:(.text.startup+0xe5):
	undefined reference to `common_data'

gnome-builder-48.0-alt1
	Selected version libtemplate-glib-devel#3.36.3-alt1:sisyphus+368370.100.1.1 на 1736414144
	for libtemplate-glib-devel>=3.36.1
	E: Couldn't find package libdspy-devel
	hsh-install: Failed to calculate package file list.

guile22-2.2.7-alt1
	make[2]: Leaving directory '/usr/src/RPM/BUILD/guile22-2.2.7/bootstrap'
	hasher-privd: parent: handle_io: idle time limit (3600 seconds) exceeded

libpixman-3:0.44.2-alt1
	>>> UBSAN_OPTIONS=halt_on_error=1:abort_on_error=1:print_summary=1:print_stacktrace=1
	MSAN_OPTIONS=halt_on_error=1:abort_on_error=1:print_summary=1:print_stacktrace=1
	MESON_TEST_ITERATION=1
	LD_LIBRARY_PATH=/usr/src/RPM/BUILD/pixman-0.44.2/x86_64-alt-linux/pixman
	ASAN_OPTIONS=halt_on_error=1:abort_on_error=1:print_summary=1 MALLOC_PERTURB_=128
	/usr/src/RPM/BUILD/pixman-0.44.2/x86_64-alt-linux/test/composite
	Summary of Failures:
	33/33 composite		    TIMEOUT	   120.16s   killed by signal 15 SIGTERM
	Ok:		    32
	Expected Fail:	    0
	Fail:		    0
	Unexpected Pass:    0
	Skipped:	    0
	Timeout:	    1
	Full log written to
	/usr/src/RPM/BUILD/pixman-0.44.2/x86_64-alt-linux/meson-logs/testlog.txt

polars-cli-0.8.0-alt1
	Compiling polars-cli v0.8.0 (/usr/src/RPM/BUILD/polars-cli-0.8.0)
	hasher-privd: parent: handle_io: idle time limit (3600 seconds) exceeded

protobuf-3.25.5-alt6
	[ERROR] -> [Help 1]
	[ERROR]
	[ERROR] To see the full stack trace of the errors, re-run Maven with the -e switch.
	[ERROR] Re-run Maven using the -X switch to enable full debug logging.
	[ERROR]
	[ERROR] For more information about the errors and possible solutions, please read the
	following articles:
	[ERROR] [Help 1] http://cwiki.apache.org/confluence/display/MAVEN/MojoFailureException
	[ERROR]
	[ERROR] After correcting the problems, you can resume the build with the command
	[ERROR]   mvn <args> -rf :protobuf-java

python3-module-hypothesis-6.129.0-alt1
	XPASS tests/watchdog/test_database.py::test_database_listener_directory_move - Flaky
	failure on ALT Linux occasionally.
	FAILED tests/cover/test_database_backend.py::test_database_listener_memory - ...
	= 1 failed, 7017 passed, 18 skipped, 6 xfailed, 2 xpassed in 303.43s (0:05:03) =
	INFO	 : Command's result: FAILURE
	INFO	 : Command's error: Command '['python3', '-m', 'pytest', '-ra', '-nauto',
	'-Wignore::UserWarning:dateutil.zoneinfo', '--ignore=tests/crosshair', 'tests']'
	returned non-zero exit status 1.

python3-module-websockets-14.1-alt1
	.........................................................................................................................................................................................................s....s.s...........................................................................................................................................................................................................................................................................................................................................................................................................................................................................ss.......s..................................................................................................................................s.......................................................................................................................................s...........................................................................................................................s........................s.............................................E...............sss.......................s.............................................E.............................................................................................................................................................................................................................s.................................................................................................................................................................................................................................................................................................................................................................................
	ERROR: test_writing_in_recv_events_fails
	(tests.sync.test_connection.ClientConnectionTests.test_writing_in_recv_events_fails)
	Error when responding to incoming frames is correctly reported.
	--
	raise self.protocol.close_exc from original_exc
	websockets.exceptions.ConnectionClosedError: no close frame received or sent
	ERROR: test_writing_in_recv_events_fails
	(tests.sync.test_connection.ServerConnectionTests.test_writing_in_recv_events_fails)
	Error when responding to incoming frames is correctly reported.
	--
	raise self.protocol.close_exc from original_exc
	websockets.exceptions.ConnectionClosedError: no close frame received or sent
	Ran 1819 tests in 65.331s
	FAILED (errors=2, skipped=15)
	INFO	 : Command's result: FAILURE
	INFO	 : Command's error: Command '['python3', '-m', 'unittest']' returned non-zero
	exit status 1.

python3-module-zmq-26.2.1-alt1
	_zmq.py:1134: in zmq.backend.cython._zmq.Socket.send
	E   zmq.error.ZMQError: Socket operation on non-socket
	_zmq.py:1209: ZMQError
	--
	_zmq.py:1134: in zmq.backend.cython._zmq.Socket.send
	E   zmq.error.ZMQError: Socket operation on non-socket
	_zmq.py:1209: ZMQError
	--
	_zmq.py:1134: in zmq.backend.cython._zmq.Socket.send
	E   zmq.error.ZMQError: Socket operation on non-socket
	_zmq.py:1209: ZMQError
	--
	=========================== short test summary info ============================
	FAILED tests/test_log.py::TestPubLog::test_blank_root_topic - TimeoutError: T...
	FAILED tests/test_log.py::TestPubLog::test_custom_debug_formatter - zmq.error...
	FAILED tests/test_log.py::TestPubLog::test_custom_global_formatter - zmq.erro...
	FAILED tests/test_log.py::TestPubLog::test_custom_message_type - zmq.error.ZM...
	FAILED tests/test_log.py::TestPubLog::test_init_iface - zmq.error.ZMQError: S...
	FAILED tests/test_log.py::TestPubLog::test_init_socket - zmq.error.ZMQError: ...
	FAILED tests/test_log.py::TestPubLog::test_root_topic - zmq.error.ZMQError: S...
	FAILED tests/test_log.py::TestPubLog::test_set_info_formatter_via_property - ...

signon-8.61-alt1
	make[2]: Entering directory '/usr/src/RPM/BUILD/signon-8.61/src/signond'
	g++ -c -pipe -frecord-gcc-switches -Wall -g -O2 -flto=auto -fPIC -DPIC -O2 -Wall -Wextra
	-D_REENTRANT -DDEBUG_ENABLED -DNO_SIGNON_USER -DENABLE_P2P -DQT_NO_CAST_TO_ASCII
	-DQT_NO_CAST_FROM_ASCII -DSIGNOND_PLUGINS_DIR=\"/usr/lib64/signon\"
	-DSIGNOND_EXTENSIONS_DIR=\"/usr/lib64/signon/extensions\" -DSIGNOND_TRACE
	-DQT_NO_DEBUG -DQT_SQL_LIB -DQT_XML_LIB -DQT_NETWORK_LIB -DQT_DBUS_LIB -DQT_CORE_LIB
	-I. -I. -I../../lib/plugins -I../../lib/plugins/signon-plugins-common -I../../lib/signond
	-I/usr/src/RPM/BUILD/signon-8.61/lib/sim-dlc -I../../lib -I/usr/include/dbus-1.0
	-I/usr/lib64/dbus-1.0/include -I/usr/include/qt6 -I/usr/include/qt6/QtSql
	-I/usr/include/qt6/QtXml -I/usr/include/qt6/QtNetwork -I/usr/include/qt6/QtDBus
	-I/usr/include/qt6/QtCore -I. -I/usr/lib64/qt6/mkspecs/linux-g++ -o moc_backup_adaptor.o
	moc_backup_adaptor.cpp
	make[2]: Leaving directory '/usr/src/RPM/BUILD/signon-8.61/src/signond'
	make[2]: Entering directory '/usr/src/RPM/BUILD/signon-8.61/src/signond'
	g++ -c -pipe -frecord-gcc-switches -Wall -g -O2 -flto=auto -fPIC -DPIC -O2 -Wall -Wextra
	-D_REENTRANT -DDEBUG_ENABLED -DNO_SIGNON_USER -DENABLE_P2P -DQT_NO_CAST_TO_ASCII
	-DQT_NO_CAST_FROM_ASCII -DSIGNOND_PLUGINS_DIR=\"/usr/lib64/signon\"
	-DSIGNOND_EXTENSIONS_DIR=\"/usr/lib64/signon/extensions\" -DSIGNOND_TRACE
	-DQT_NO_DEBUG -DQT_SQL_LIB -DQT_XML_LIB -DQT_NETWORK_LIB -DQT_DBUS_LIB
	-DQT_CORE_LIB -I. -I. -I../../lib/plugins -I../../lib/plugins/signon-plugins-common
	-I../../lib/signond -I/usr/src/RPM/BUILD/signon-8.61/lib/sim-dlc -I../../lib
	-I/usr/include/dbus-1.0 -I/usr/lib64/dbus-1.0/include -I/usr/include/qt6
	-I/usr/include/qt6/QtSql -I/usr/include/qt6/QtXml -I/usr/include/qt6/QtNetwork
	-I/usr/include/qt6/QtDBus -I/usr/include/qt6/QtCore -I. -I/usr/lib64/qt6/mkspecs/linux-g++
	-o moc_signonidentityadaptor.o moc_signonidentityadaptor.cpp
	make[2]: Leaving directory '/usr/src/RPM/BUILD/signon-8.61/src/signond'
	make[2]: Entering directory '/usr/src/RPM/BUILD/signon-8.61/src/signond'
	g++ -Wl,-O1 -o signond	accesscontrolmanagerhelper.o credentialsaccessmanager.o
	credentialsdb.o default-crypto-manager.o default-key-authorizer.o default-secrets-storage.o
	erroradaptor.o signonsessioncore.o signonauthsessionadaptor.o signonauthsession.o
	signonidentity.o signondaemonadaptor.o signondisposable.o signonui_interface.o
	pluginproxy.o main.o signondaemon.o signonidentityinfo.o signonidentityadaptor.o
	signonsecuritycontext.o signonsessioncoretools.o moc_credentialsaccessmanager.o
	moc_credentialsdb.o moc_default-crypto-manager.o moc_default-key-authorizer.o
	moc_default-secrets-storage.o moc_signonsessioncore.o moc_signonauthsessionadaptor.o
	moc_signonauthsession.o moc_signonidentity.o moc_signondaemonadaptor.o
	moc_signondaemon.o moc_signondisposable.o moc_pluginproxy.o moc_signonui_interface.o
	moc_signonidentityadaptor.o backup_adaptor.o moc_backup_adaptor.o
	-L/usr/src/RPM/BUILD/signon-8.61/lib/plugins/signon-plugins-common
	-L/usr/src/RPM/BUILD/signon-8.61/lib/signond/SignOn -lrt -lsignon-plugins-common
	-lsignon-extension -ldbus-1 /usr/lib64/libQt6Sql.so /usr/lib64/libQt6Xml.so
	/usr/lib64/libQt6Network.so /usr/lib64/libQt6DBus.so /usr/lib64/libQt6Core.so -lpthread
	make[2]: Leaving directory '/usr/src/RPM/BUILD/signon-8.61/src/signond'
	make: *** [Makefile:74: sub-src-make_first] Error 2

	14 error logs REMOVED from the list
ccnet-7.1.1-alt1
event-driven-servers-1.0-alt3
findutils-4.9.0.0.9.e5c6-alt1
java-1.8.0-openjdk-0:1.8.0.442.b06-alt1_1jpp8
libgda6-6.0.0-alt2
python-2.7.18-alt11
python3-module-Pygments-2.19.1-alt1
python3-module-easyprocess-1.1-alt2
python3-module-eventlet-0.39.1-alt1
python3-module-execnet-2.1.1-alt1
python3-module-fastapi-0.115.11-alt1
python3-module-yaql-3.0.0-alt1
racket-main-8.8-alt1
tmux-3.5a-alt1

Total 294 error logs.


Подробная информация о списке рассылки Sisyphus-cybertalk