[cyber] I: p11-20250316 x86_64 beehive_status: +2 -11 (99)
ALT beekeeper
hiver на altlinux.org
Вс Мар 16 08:31:15 MSK 2025
2 NEW error logs
lightdm-1.32.0-alt8
# SKIP: 0
# XFAIL: 0
# FAIL: 1
# XPASS: 0
# ERROR: 0
See tests/test-suite.log
--
# SKIP: 0
# XFAIL: 0
# FAIL: 1
# XPASS: 0
# ERROR: 0
.. contents:: :depth: 2
FAIL: test-autologin-unknown
** (process:646958): WARNING **: 04:05:23.245: Error loading passwd file: Failed to
open file ?/tmp/.r0/etc/passwd?: No such file or directory
** (process:646965): WARNING **: 04:05:23.254: Error loading passwd file: Failed to
open file ?/tmp/.r0/etc/passwd?: No such file or directory
** (process:646972): WARNING **: 04:05:23.262: Error loading passwd file: Failed to
open file ?/tmp/.r0/etc/passwd?: No such file or directory
** (process:646977): WARNING **: 04:05:23.270: Error loading passwd file: Failed to
open file ?/tmp/.r0/etc/passwd?: No such file or directory
mumps-5.3.5-alt3
/usr/lib64/openmpi/bin/mpicc -shared graph.o gbipart.o gbisect.o ddcreate.o ddbisect.o
nestdiss.o multisector.o gelim.o bucket.o tree.o symbfac.o interface.o sort.o minpriority.o
-Wl,-soname,libpord-5.3.so -o libpord-5.3.so -Wl,--as-needed,-rpath,/usr/lib64/openmpi/lib
-L/usr/lib64/openmpi/lib -Wl,-z,defs
lto1: internal compiler error: resolution sub id 0xd67847c260608d94 not in object file
libbacktrace could not find executable to open
--
See <http://bugzilla.altlinux.org> for instructions.
lto-wrapper: fatal error: x86_64-alt-linux-gcc returned 1 exit status
compilation terminated.
ld: error: lto-wrapper failed
collect2: error: ld returned 1 exit status
make[2]: *** [Makefile:34: libpord.so] Error 1
11 error logs REMOVED from the list
cppcheck-2.16.1-alt2
fractal-7-alt1
gem-aws-sdk-1:3.1.0-alt1
givaro-4.2.0-alt3
goldendict-ng-24.05.05-alt1
libmozjs78-78.11.0-alt2.1
python-2.7.18-alt11
python3-module-pyshark-0.6-alt2
python3-module-websockets-12.0-alt1
qt6-tools-6.8.2-alt1
zstd-1.5.5-alt2
Total 99 error logs.
Подробная информация о списке рассылки Sisyphus-cybertalk