[cyber] I: Sisyphus-20250314 x86_64 beehive_status: +18 -18 (291)

ALT beekeeper hiver на altlinux.org
Пт Мар 14 09:12:53 MSK 2025


	18 NEW error logs

bpftrace-0.22.1-alt1
	[	 SKIP	] probe.kprobe_offset_module_error (unmet condition: 'lsmod | grep
	'^nf_tables'')
	[	FAILED	] 8 tests, listed below:
	[	TIMEOUT ] btf.tracepoint_nested_pointer_type_resolution

cppcheck-2.16.2-alt1_1_1f61c2e8d
	cd /usr/src/RPM/BUILD/cppcheck-2.16.2/x86_64-alt-linux/lib &&
	/usr/bin/c++ -DFILESDIR=\"/usr/share/Cppcheck\" -DHAVE_RULES
	-I/usr/src/RPM/BUILD/cppcheck-2.16.2/x86_64-alt-linux/lib
	-I/usr/src/RPM/BUILD/cppcheck-2.16.2/lib -I/usr/src/RPM/BUILD/cppcheck-2.16.2/externals
	-I/usr/src/RPM/BUILD/cppcheck-2.16.2/externals/tinyxml2
	-I/usr/src/RPM/BUILD/cppcheck-2.16.2/externals/picojson
	-I/usr/src/RPM/BUILD/cppcheck-2.16.2/externals/simplecpp -isystem /usr/include/pcre
	-pipe -frecord-gcc-switches -Wall -g -O2 -flto=auto -Wno-error=return-type -O2
	-DNDEBUG -std=gnu++11 -O2 -pedantic -Wall -Wextra -Wcast-qual -Wfloat-equal
	-Wmissing-declarations -Wmissing-format-attribute -Wno-long-long -Wpacked
	-Wredundant-decls -Wundef -Wno-missing-field-initializers -Wno-missing-braces
	-Wno-sign-compare -Wno-multichar -Woverloaded-virtual -pipe -Wno-maybe-uninitialized
	-Wsuggest-attribute=noreturn -Wno-shadow -Wuseless-cast -Winvalid-pch -include
	/usr/src/RPM/BUILD/cppcheck-2.16.2/x86_64-alt-linux/lib/CMakeFiles/cppcheck-core.dir/cmake_pch.hxx
	-MD -MT lib/CMakeFiles/cppcheck-core.dir/build/mc_vf_settokenvalue.cpp.o
	-MF CMakeFiles/cppcheck-core.dir/build/mc_vf_settokenvalue.cpp.o.d
	-o CMakeFiles/cppcheck-core.dir/build/mc_vf_settokenvalue.cpp.o -c
	/usr/src/RPM/BUILD/cppcheck-2.16.2/x86_64-alt-linux/lib/build/mc_vf_settokenvalue.cpp
	gmake[2]: Leaving directory '/usr/src/RPM/BUILD/cppcheck-2.16.2/x86_64-alt-linux'
	gmake[2]: Entering directory '/usr/src/RPM/BUILD/cppcheck-2.16.2/x86_64-alt-linux'
	[ 57%] Building CXX object lib/CMakeFiles/cppcheck-core.dir/build/mc_vf_subfunction.cpp.o
	cd /usr/src/RPM/BUILD/cppcheck-2.16.2/x86_64-alt-linux/lib &&
	/usr/bin/c++ -DFILESDIR=\"/usr/share/Cppcheck\" -DHAVE_RULES
	-I/usr/src/RPM/BUILD/cppcheck-2.16.2/x86_64-alt-linux/lib
	-I/usr/src/RPM/BUILD/cppcheck-2.16.2/lib -I/usr/src/RPM/BUILD/cppcheck-2.16.2/externals
	-I/usr/src/RPM/BUILD/cppcheck-2.16.2/externals/tinyxml2
	-I/usr/src/RPM/BUILD/cppcheck-2.16.2/externals/picojson
	-I/usr/src/RPM/BUILD/cppcheck-2.16.2/externals/simplecpp -isystem /usr/include/pcre
	-pipe -frecord-gcc-switches -Wall -g -O2 -flto=auto -Wno-error=return-type -O2
	-DNDEBUG -std=gnu++11 -O2 -pedantic -Wall -Wextra -Wcast-qual -Wfloat-equal
	-Wmissing-declarations -Wmissing-format-attribute -Wno-long-long -Wpacked
	-Wredundant-decls -Wundef -Wno-missing-field-initializers -Wno-missing-braces
	-Wno-sign-compare -Wno-multichar -Woverloaded-virtual -pipe -Wno-maybe-uninitialized
	-Wsuggest-attribute=noreturn -Wno-shadow -Wuseless-cast -Winvalid-pch -include
	/usr/src/RPM/BUILD/cppcheck-2.16.2/x86_64-alt-linux/lib/CMakeFiles/cppcheck-core.dir/cmake_pch.hxx
	-MD -MT lib/CMakeFiles/cppcheck-core.dir/build/mc_vf_subfunction.cpp.o
	-MF CMakeFiles/cppcheck-core.dir/build/mc_vf_subfunction.cpp.o.d
	-o CMakeFiles/cppcheck-core.dir/build/mc_vf_subfunction.cpp.o -c
	/usr/src/RPM/BUILD/cppcheck-2.16.2/x86_64-alt-linux/lib/build/mc_vf_subfunction.cpp
	gmake[2]: Leaving directory '/usr/src/RPM/BUILD/cppcheck-2.16.2/x86_64-alt-linux'
	gmake[1]: Entering directory '/usr/src/RPM/BUILD/cppcheck-2.16.2/x86_64-alt-linux'
	[ 58%] Built target cppcheck-core
	gmake[1]: Leaving directory '/usr/src/RPM/BUILD/cppcheck-2.16.2/x86_64-alt-linux'
	gmake: *** [Makefile:146: all] Error 2

dopewars-1.5.12-alt2_20.1033svn
	/bin/sh ../../libtool --mode=link x86_64-alt-linux-gcc	-pipe -frecord-gcc-switches
	-Wall -g -O2 -flto=auto -Wall  -o libsound_sdl.la -rpath /usr/lib64 -lSDL -lpthread
	-lSDL_mixer sound_sdl.lo  -lglib-2.0
	libtool: link: rm -fr  .libs/libsound_sdl.a
	libtool: link: x86_64-alt-linux-gcc -shared  -fPIC -DPIC  .libs/sound_sdl.o   -lSDL
	-lpthread -lSDL_mixer -lglib-2.0  -g -O2 -flto=auto   -Wl,-soname -Wl,libsound_sdl.so.0
	-o .libs/libsound_sdl.so.0.0.0
	libtool: link: (cd ".libs" && rm -f "libsound_sdl.so.0" && ln -s "libsound_sdl.so.0.0.0"
	"libsound_sdl.so.0")
	libtool: link: (cd ".libs" && rm -f "libsound_sdl.so" && ln -s "libsound_sdl.so.0.0.0"
	"libsound_sdl.so")
	libtool: link: ( cd ".libs" && rm -f "libsound_sdl.la" && ln -s "../libsound_sdl.la"
	"libsound_sdl.la" )
	make[3]: Leaving directory '/usr/src/RPM/BUILD/dopewars/src/plugins'
	make[2]: *** [Makefile:577: all-recursive] Error 1
	make[1]: *** [Makefile:478: all-recursive] Error 1
	make: *** [Makefile:406: all] Error 2

fwupd-2.0.6-alt1
	[1290/1349] Generating plugins/uefi-capsule/ux-capsule-tar with a custom command
	FAILED: plugins/uefi-capsule/uefi-capsule-ux.tar.xz
	/usr/bin/python3 ../plugins/uefi-capsule/make-images.py --podir
	/usr/src/RPM/BUILD/fwupd-2.0.6/po --label 'Installing firmware updateБ─╕' --out
	plugins/uefi-capsule/uefi-capsule-ux.tar.xz
	--
	Pango.shape(label_translated, length, items[0].analysis, gs)
	TypeError: Pango.shape() takes exactly 3 arguments (4 given)
	[1291/1349] Linking target plugins/cpu/fwupd-detect-cet

guile22-2.2.7-alt1
	WARNING: (test-suite sxml-xpath): imported module (sxml xpath) overrides core binding
	`filter'
	FAIL: check-guile
	1 of 1 test failed

libgupnp-igd-1.6.0-alt1
	1/1 gupnp-simple-igd FAIL	     7.89s   killed by signal 5 SIGTRAP
	Summary of Failures:
	1/1 gupnp-simple-igd FAIL	     7.89s   killed by signal 5 SIGTRAP
	Ok:		    0
	Expected Fail:	    0
	Fail:		    1
	Unexpected Pass:    0
	Skipped:	    0
	Timeout:	    0
	Full log written to
	/usr/src/RPM/BUILD/gupnp-igd-1.6.0/x86_64-alt-linux/meson-logs/testlog.txt

libsecret-0.21.6-alt1
	24/24 libsecret:libsecret / test-service	  OK		 14.00s
	Summary of Failures:
	6/24 libsecret:libsecret / test-prompt		 FAIL		 0.17s	 (exit status
	134 or signal 6 SIGABRT)
	Ok:		    23
	Expected Fail:	    0
	Fail:		    1
	Unexpected Pass:    0
	Skipped:	    0
	Timeout:	    0
	Full log written to
	/usr/src/RPM/BUILD/libsecret-0.21.6/x86_64-alt-linux/meson-logs/testlog.txt

libwebrtc-audio-processing-1.3-alt2
	[307/308] Linking target webrtc/modules/audio_coding/libwebrtc-audio-coding-1.so.3
	hasher-privd: parent: handle_io: idle time limit (3600 seconds) exceeded

python-2.7.18-alt11
	self._sslobj.do_handshake()
	SSLZeroReturnError: TLS/SSL connection has been closed (EOF) (_ssl.c:735)
	Exception in thread Thread-75:
	--
	self._sslobj.do_handshake()
	SSLZeroReturnError: TLS/SSL connection has been closed (EOF) (_ssl.c:735)
	Exception in thread Thread-76:
	--
	self._sslobj.do_handshake()
	SSLZeroReturnError: TLS/SSL connection has been closed (EOF) (_ssl.c:735)
	Exception in thread Thread-77:
	--
	self._sslobj.do_handshake()
	SSLZeroReturnError: TLS/SSL connection has been closed (EOF) (_ssl.c:735)
	Exception in thread Thread-78:
	--
	self._sslobj.do_handshake()
	SSLZeroReturnError: TLS/SSL connection has been closed (EOF) (_ssl.c:735)
	Exception in thread Thread-79:
	--
	self._sslobj.do_handshake()
	SSLZeroReturnError: TLS/SSL connection has been closed (EOF) (_ssl.c:735)
	Exception in thread Thread-80:
	--
	self._sslobj.do_handshake()
	SSLZeroReturnError: TLS/SSL connection has been closed (EOF) (_ssl.c:735)
	Warning -- asyncore.socket_map was modified by test_ftplib

python3-module-aiohttp-3.11.13-alt1
	SKIPPED [1] tests/test_multipart_helpers.py:99: need more smart parser which respects
	quoted text
	SKIPPED [1] tests/test_multipart_helpers.py:446: should raise decoding error: %82 is
	invalid for latin1
	SKIPPED [1] tests/test_multipart_helpers.py:455: should raise decoding error: %E4 is
	invalid for utf-8
	SKIPPED [1] tests/test_multipart_helpers.py:510: urllib.parse.unquote is tolerate to
	standalone % chars
	--
	XFAIL tests/test_worker.py::test__create_ssl_context_with_ca_certs[AsyncioWorker-pyloop]
	- reason: trustme is not supported
	FAILED
	tests/test_client_ws_functional.py::test_heartbeat_no_pong_after_send_many_messages[pyloop]
	====== 1 failed, 3067 passed, 36 skipped, 26 xfailed in 60.30s (0:01:00) =======
	INFO	 : Command's result: FAILURE
	INFO	 : Command's error: Command '['python3', '-m', 'pytest', '-m', 'not dev_mode
	and not internal', '--ignore=tests/autobahn', '--ignore=tests/test_proxy_functional.py',
	'--ignore-glob=tests/test_benchmarks_*', 'tests']' returned non-zero exit status 1.

python3-module-eventlet-0.39.1-alt1
	>	    assert ok, 'Expected single line "pass" in stdout'
	E	    AssertionError: Expected single line "pass" in stdout
	tests/__init__.py:358: AssertionError
	--
	assert len(mod._active) == n, 'Expected {} {} threads, got {}'.format(n, tag, mod._active)
	AssertionError: Expected 2 post-fork patched threads, got {139642664314688:
	<_MainThread(MainThread, started 139642664314688)>}
	=============================== warnings summary ===============================
	--
	=========================== short test summary info ============================
	FAILED tests/patcher_test.py::test_fork_after_monkey_patch - AssertionError: ...
	= 1 failed, 640 passed, 89 skipped, 12 deselected, 52 warnings in 151.88s (0:02:31) =
	INFO	 : Command's result: FAILURE
	INFO	 : Command's error: Command '['python3', '-m', 'pytest', '-v', '-k', 'not
	test_dns_methods_are_green and not test_noraise_dns_tcp and not test_clear and not
	test_raise_dns_tcp']' returned non-zero exit status 1.
	error: Bad exit status from /usr/src/tmp/rpm-tmp.18659 (%check)

python3-module-hypothesis-6.129.0-alt1
	XPASS tests/watchdog/test_database.py::test_database_listener_directory_move - Flaky
	failure on ALT Linux occasionally.
	FAILED tests/cover/test_stateful.py::test_can_run_with_no_db - hypothesis.err...
	= 1 failed, 7017 passed, 18 skipped, 6 xfailed, 2 xpassed in 159.03s (0:02:39) =
	INFO	 : Command's result: FAILURE
	INFO	 : Command's error: Command '['python3', '-m', 'pytest', '-ra', '-nauto',
	'-Wignore::UserWarning:dateutil.zoneinfo', '--ignore=tests/crosshair', 'tests']'
	returned non-zero exit status 1.

python3-module-pexpect-4.9.0-alt1
	tests/test_replwrap.py::REPLWrapTestCase::test_python PASSED		 [ 66%]
	tests/test_replwrap.py::REPLWrapTestCase::test_zsh FAILED		 [ 67%]
	tests/test_repr.py::TestCaseMisc::test_str_before_spawn PASSED		 [ 67%]
	--
	tests/test_socket.py::ExpectTestCase::test_interrupt
	hasher-privd: parent: handle_io: idle time limit (3600 seconds) exceeded

python3-module-sanic-24.6.0-alt2
	tests/test_cli.py .....................................................
	hasher-privd: parent: handle_io: idle time limit (3600 seconds) exceeded

snapd-glib-2-1.66-alt1
	Summary of Failures:
	3/4 Tests		 TIMEOUT	600.14s   killed by signal 15 SIGTERM
	4/4 Tests (qt6		 TIMEOUT	600.13s   killed by signal 15 SIGTERM
	Ok:		    2
	Expected Fail:	    0
	Fail:		    0
	Unexpected Pass:    0
	Skipped:	    0
	Timeout:	    2
	Full log written to
	/usr/src/RPM/BUILD/snapd-glib-1.66/x86_64-alt-linux/meson-logs/testlog.txt

vaultwarden-1.33.2-alt2
	Running `rustc --crate-name vaultwarden --edition=2021 src/main.rs --error-format=json
	--json=diagnostic-rendered-ansi,artifacts,future-incompat --crate-type bin
	--emit=dep-info,link -C opt-level=3 -C lto=fat -C codegen-units=1 --deny=unused
	--deny=rust_2024_compatibility --deny=rust_2021_compatibility --deny=rust_2018_idioms
	--deny=refining_impl_trait --deny=let_underscore --deny=keyword_idents
	--deny=future_incompatible '--deny=clippy::zero_sized_map_values'
	'--deny=clippy::verbose_file_reads' --deny=variant_size_differences
	'--deny=clippy::unused_self' --deny=unused_qualifications --deny=unused_lifetimes
	--deny=unused_import_braces '--deny=clippy::unused_async' --forbid=unsafe_code
	'--deny=clippy::unnested_or_patterns' '--deny=clippy::unnecessary_self_imports'
	'--deny=clippy::unnecessary_join' --deny=trivial_numeric_casts --deny=trivial_casts
	'--warn=clippy::todo' --allow=tail_expr_drop_order '--deny=clippy::string_to_string'
	'--deny=clippy::string_add_assign' --deny=single_use_lifetimes
	'--deny=clippy::option_option' --deny=noop_method_call --forbid=non_ascii_idents
	'--deny=clippy::needless_lifetimes' '--deny=clippy::needless_continue'
	'--deny=clippy::mem_forget' '--deny=clippy::match_wildcard_for_single_variants'
	'--deny=clippy::match_on_vec_items' '--deny=clippy::manual_string_new'
	'--deny=clippy::manual_instant_elapsed' '--deny=clippy::manual_assert'
	'--deny=clippy::macro_use_imports' '--deny=clippy::linkedlist'
	'--deny=clippy::iter_on_single_items' '--deny=clippy::iter_on_empty_collections'
	'--deny=clippy::inefficient_to_string' --allow=if_let_rescope
	'--deny=clippy::float_cmp_const' '--deny=clippy::filter_map_next'
	'--deny=clippy::equatable_if_let' --allow=edition_2024_expr_fragment_specifier
	--deny=deprecated_in_future '--warn=clippy::dbg_macro' '--deny=clippy::clone_on_ref_ptr'
	'--deny=clippy::cast_lossless' '--deny=clippy::case_sensitive_file_extension_comparisons'
	--cfg 'feature="mysql"' --cfg 'feature="postgresql"' --cfg 'feature="sqlite"'
	--check-cfg 'cfg(docsrs,test)' --check-cfg 'cfg(feature, values("enable_mimalloc",
	"enable_syslog", "mysql", "postgresql", "query_logger", "sqlite", "unstable",
	"vendored_openssl"))' -C metadata=f3e2d64f627c5b26 -C extra-filename=-0af19586d4f5713b
	--out-dir /usr/src/RPM/BUILD/vaultwarden-1.33.2/target/release/deps -L
	dependency=/usr/src/RPM/BUILD/vaultwarden-1.33.2/target/release/deps --extern
	argon2=/usr/src/RPM/BUILD/vaultwarden-1.33.2/target/release/deps/libargon2-acf080c07828bf3d.rlib
	--extern
	bigdecimal=/usr/src/RPM/BUILD/vaultwarden-1.33.2/target/release/deps/libbigdecimal-080b9270fb68e108.rlib
	--extern
	bytes=/usr/src/RPM/BUILD/vaultwarden-1.33.2/target/release/deps/libbytes-b6d57e4f55122b14.rlib
	--extern
	cached=/usr/src/RPM/BUILD/vaultwarden-1.33.2/target/release/deps/libcached-3860092cbc355f49.rlib
	--extern
	chrono=/usr/src/RPM/BUILD/vaultwarden-1.33.2/target/release/deps/libchrono-8acc2791150f9bcd.rlib
	--extern
	chrono_tz=/usr/src/RPM/BUILD/vaultwarden-1.33.2/target/release/deps/libchrono_tz-1c6f5d05ae20b379.rlib
	--extern
	cookie=/usr/src/RPM/BUILD/vaultwarden-1.33.2/target/release/deps/libcookie-212155927c899c65.rlib
	--extern
	cookie_store=/usr/src/RPM/BUILD/vaultwarden-1.33.2/target/release/deps/libcookie_store-6f987f4b61fe9268.rlib
	--extern
	dashmap=/usr/src/RPM/BUILD/vaultwarden-1.33.2/target/release/deps/libdashmap-f23c042e3ec9cfbb.rlib
	--extern
	data_encoding=/usr/src/RPM/BUILD/vaultwarden-1.33.2/target/release/deps/libdata_encoding-b86bcddfaa3b0aba.rlib
	--extern
	data_url=/usr/src/RPM/BUILD/vaultwarden-1.33.2/target/release/deps/libdata_url-9977f5843fd0d5cd.rlib
	--extern
	derive_more=/usr/src/RPM/BUILD/vaultwarden-1.33.2/target/release/deps/libderive_more-5971d2a31efe4390.rlib
	--extern
	diesel=/usr/src/RPM/BUILD/vaultwarden-1.33.2/target/release/deps/libdiesel-d4868d22b85c4b2c.rlib
	--extern
	diesel_derive_newtype=/usr/src/RPM/BUILD/vaultwarden-1.33.2/target/release/deps/libdiesel_derive_newtype-e46313ea15c55450.so
	--extern
	diesel_migrations=/usr/src/RPM/BUILD/vaultwarden-1.33.2/target/release/deps/libdiesel_migrations-aba97dd5e2c3bd7c.rlib
	--extern dotenvy=/usr
	hasher-privd: parent: handle_io: idle time limit (3600 seconds) exceeded

verilator-5.018-alt1
	221 | struct yy_buffer_state
	V3PreLex_pregen.yy.cpp:489:8: note: a different type is defined in another translation unit
	489 | struct yy_buffer_state
	V3Lexer_pregen.yy.cpp:227:25: note: the first difference of corresponding definitions
	is field 'yy_input_file'
	227 |	      std::streambuf* yy_input_file;
	V3PreLex_pregen.yy.cpp:492:15: note: a field of same name but different type is defined
	in another translation unit
	492 |	      FILE *yy_input_file;
	V3Lexer_pregen.yy.cpp:221:8: note: type name 'std::basic_streambuf<char,
	std::char_traits<char> >' should match type name '_IO_FILE'
	221 | struct yy_buffer_state
	make[2]: Leaving directory '/usr/src/RPM/BUILD/verilator-5.018/src/obj_dbg'

zstd-1.5.5-alt2
	test206 : ZSTD_adjustCParams() + dictionary OK
	test207 : check compression mem usage monotonicity over levels for estimateCCtxSize() : OK
	test208 : check estimateCCtxSize() always larger or equal to
	ZSTD_estimateCCtxSize_usingCParams() : OK
	test209 : thread pool API tests :
	thread pool test : threadPool re-use roundtrips: OK
	thread pool test : threadPool simultaneous usage: OK
	thread pool tests OK
	1	   
	19	    
	 35	     
	  41	      
    46	       
    57
	
    58		 
    64	  
    70	   
	74	    
	 92	     
	94	    
	100	     
	 101	      
   106	       
   108		
   110
	
   120		 
   131	  
   145	   
   171	    
	185	     
	198	     
	 200	      
   202	       
   219		
   221		 
   222
	
   231		 
   242	  
   250	   
   264	    
	269	     
	284	     
	 291	      
   296	       
   299		
   303		 
   319
	
   327		 
   331	  
   333	   
   334	    
	350	     
	369	     
	 372	      
   387	       
   390		
   399		 
   402
	
   410		 
   415	  
   423	   
   425	    
	442	     
	446	     
	 457	      
   459	       
   461		
   472		 
   475
	
   480		 
   482	  
   484	   
   487	    
	491	     
	504	     
	 511	      
   515	       
   517		
   521		 
   529
	
   536		 
   541	  
   549	   
   560	    
	564	     
	570	     
	 571	      
   578	       
   580		
   593		 
   597
	
   598		 
   612	  
   620	   
   634	    
	638	     
	649	     
	 653	      
   657	       
   661		
   666		 
   684
	
   697		 
   708	  
   713	   
   718	    
	721	     
	726	     
	 738	      
   746	       
   756		
   761		 
   774
	
   779		 
   783	  
   786	   
   793	    
	811	     
	820	     
	 824	      
   848	       
   849		
   856		 
   862
	
   868		 
   872	  
   875	   
   877	    
	880	     
	881	     
	 888	      
   906	       
   916		
   932		 
   937
	
   952		 
   968	  
   984	   
   988	    
	997	     
	1011	      
  1016	       
  1030		
  1040		 
  1047	  
  1049
	
  1051		 
  1054	  
  1061	   
  1067	    
  1075	     
	1088	      
  1104	       
  1106		
  1119		 
  1127	  
  1137
	
  1141		 
  1145	  
  1152	   
  1160	    
  1162	     
	1168	      
  1173	       
  1192		
  1197		 
  1207	  
  1215
	
  1227		 
  1230	  
  1236	   
  1247	    
  1251	     
	1254	      
  1264	       
  1276		
  1280		 
  1290	  
	1302	      
  1315	       
  1316		
  1325		 
  1331	  
	1339	      
  1351	       
  1357		
  1367		 
  1376	  
	1377	      
  1381	       
  1387		
  1390		 
  1400	  
	1408	      
  1417	       
  1419		
  1438		 
  1453	  
	1456	      
  1474	       
  1485		
  1490		 
  1499	  
	1505	      
  1517	       
  1525		
  1526		 
  1537	  
	1545	      
  1551	       
  1555		
  1560		 
  1571	  
	1578	      
  1581	       
  1583		
  1597		 
  1601	  
	1604	      
  1619	       
  1632		
  1642		 
  1644	  
	1648	      
  1668	       
  1674		
  1676		 
  1680	  
	1691	      
  1696	       
  1702		
  1705		 
  1717	  
	1723	      
  1734	       
  1743		
  1749		 
  1752	  
	1755	      
  1762	       
  1763		
  1764		 
  1779	  
	1784	      
  1793	       
  1812		
  1819		 
  1835	  
  1843
	make: Leaving directory '/usr/src/RPM/BUILD/zstd-1.5.5-alt2/tests'
	make: Target 'test' not remade because of errors.

	18 error logs REMOVED from the list
cilk-5.4.6-alt13
cosmic-applets-1.0.0-alt0.60.alpha.6
deepin-system-monitor-6.5.2-alt1
gcr4-4.3.1-alt1
java-1.8.0-openjdk-0:1.8.0.442.b06-alt1_1jpp8
kitty-0.39.1-alt1
nss-3.109-alt1
oddjob-0.34.7-alt1
perl-Crypt-RSA-1.99-alt2
polars-cli-0.8.0-alt1
python3-module-aiohttp-3.11.12-alt1
python3-module-hypothesis-jsonschema-0.23.1-alt1
python3-module-jupyter_server-2.15.0-alt2
python3-module-pyshark-0.6-alt2
python3-module-schemathesis-3.39.9-alt1
python3-module-silx-2.2.1-alt1
tmux-3.5a-alt1
zig-0.13.0-alt1

Total 291 error logs.


Подробная информация о списке рассылки Sisyphus-cybertalk