[cyber] I: Sisyphus-20250311 x86_64 beehive_status: +17 -19 (294)
ALT beekeeper
hiver на altlinux.org
Вт Мар 11 08:32:34 MSK 2025
17 NEW error logs
bdsync-0.11.2-alt3.1
--> PASS
test12.sh:
**** Checking: stderr forwarding and status returning of subprocess
--> PASS
test13.sh:
**** Checking: stderr forwarding and status returning of subprocess prior to bdsync
execution
| Inconsistent checksums MD5ER1/MD5ER2
--> FAIL
make: *** [Makefile:16: test] Error 1
make: Leaving directory '/usr/src/RPM/BUILD/bdsync-0.11.2'
calligraplan-0:3.3.0-alt1
Selecting kf5-kholidays-devel for 'kde5-kholidays-devel'
E: Couldn't find package kf5-khtml-devel
hsh-install: Failed to calculate package file list.
dm-secdel-1.0.11-alt2
systemctl daemon-reload
make: systemctl: No such file or directory
make: [Makefile:24: install-bin] Error 127 (ignored)
systemctl enable secdeltab
make: systemctl: No such file or directory
make: [Makefile:25: install-bin] Error 127 (ignored)
erlang-proper-1.4.0.19.3bbd-alt1
1) proper_tests:-false_props_test_/0-fun-384-/0:1025
[0;31m Failure/Error: ?assertEqual(false, proper : quickcheck ( fun_tests :
prop_fun_int_int ( ) ))
expected: false
guile22-2.2.7-alt1
WARNING: (test-suite sxml-xpath): imported module (sxml xpath) overrides core binding
`filter'
FAIL: check-guile
1 of 1 test failed
kitty-0.39.1-alt1
test_bash_integration
(kitty_tests.shell_integration.ShellIntegration.test_bash_integration) ... ok
test_fish_integration
(kitty_tests.shell_integration.ShellIntegration.test_fish_integration) ... ERROR
test_zsh_integration (kitty_tests.shell_integration.ShellIntegration.test_zsh_integration)
... skipped 'zsh not installed'
test_bash_integration
(kitty_tests.shell_integration.ShellIntegrationWithKitten.test_bash_integration) ... ok
test_fish_integration
(kitty_tests.shell_integration.ShellIntegrationWithKitten.test_fish_integration) ... ERROR
test_zsh_integration
(kitty_tests.shell_integration.ShellIntegrationWithKitten.test_zsh_integration)
... skipped 'zsh not installed'
--
test_num_users (kitty_tests.utmp.UTMPTest.test_num_users) ... ok
ERROR: test_fish_integration
(kitty_tests.shell_integration.ShellIntegration.test_fish_integration)
Traceback (most recent call last):
--
timeout_msg = <function ShellIntegration.assert_command.<locals>.<lambda> at
0x7f6644179300>
TimeoutError: Timed out: pty.callbacks.last_cmd_cmdline='' != 'string match -q --
"*/usr/src/RPM/BUILD/kitty-0.39.1/linux-package/lib/kitty/shell-integration*"
"$XDG_DATA_DIRS" || echo "XDD_OK"'. Screen contents:
'left>string match -q --
"*/usr/src/RPM/BUILD/kitty-0.39.1/linux-package/lib/kitty/shell-integration*"
"$XDG_DATA_DIRS" || echo
"XDD_OK" <right\nXDD_OK\nleft>
<right'
ERROR: test_fish_integration
(kitty_tests.shell_integration.ShellIntegrationWithKitten.test_fish_integration)
Traceback (most recent call last):
--
timeout_msg = <function ShellIntegration.assert_command.<locals>.<lambda> at
0x7f663f6c1d00>
TimeoutError: Timed out: pty.callbacks.last_cmd_cmdline='' != 'string match -q --
"*/usr/src/RPM/BUILD/kitty-0.39.1/linux-package/lib/kitty/shell-integration*"
"$XDG_DATA_DIRS" || echo "XDD_OK"'. Screen contents:
'left>string match -q --
"*/usr/src/RPM/BUILD/kitty-0.39.1/linux-package/lib/kitty/shell-integration*"
"$XDG_DATA_DIRS" || echo "XDD_OK" <right\nleft>
<right'
Ran 148 tests in 29.721s
FAILED (errors=2, skipped=4)
All Go tests succeeded, ran in 34.8 seconds
[31mError[39m: Some tests failed!
ktechlab-0.51.0-alt2.1
rpm-build-ninja is already the newest version.
E: Couldn't find package kf5-khtml-devel
hsh-install: Failed to calculate package file list.
libgda6-6.0.0-alt2
[716/796] Generating libgda-ui/gdaui6.0_vapi with a custom command
FAILED: libgda-ui/libgdaui-6.0.vapi
/usr/bin/vapigen-0.56 --girdir=/usr/src/RPM/BUILD/libgda-6.0.0/x86_64-alt-linux/libgda
--metadatadir=/usr/src/RPM/BUILD/libgda-6.0.0/libgda-ui --library=libgdaui-6.0
--directory=/usr/src/RPM/BUILD/libgda-6.0.0/x86_64-alt-linux/libgda-ui
--vapidir=/usr/src/RPM/BUILD/libgda-6.0.0/x86_64-alt-linux/libgda --pkg=libxml-2.0
--pkg=gio-2.0 --pkg=libgda-6.0 --pkg=gtk+-3.0 libgda-ui/Gdaui-6.0.gir
../libgda-ui/Gda-6.0-custom.vala
error: Package `libgda-6.0' not found in specified Vala API directories or
GObject-Introspection GIR directories
Generation failed: 1 error(s), 0 warning(s)
libgupnp-igd-1.6.0-alt1
1/1 gupnp-simple-igd FAIL 6.91s killed by signal 5 SIGTRAP
Summary of Failures:
1/1 gupnp-simple-igd FAIL 6.91s killed by signal 5 SIGTRAP
Ok: 0
Expected Fail: 0
Fail: 1
Unexpected Pass: 0
Skipped: 0
Timeout: 0
Full log written to
/usr/src/RPM/BUILD/gupnp-igd-1.6.0/x86_64-alt-linux/meson-logs/testlog.txt
libliftoff-0.5.0-alt1
layer 2 got assigned to plane -1
ERROR: want plane 2
test-alloc: ../test/test_alloc.c:843: run_test: Assertion `ok' failed.
--
Full log written to
/usr/src/RPM/BUILD/libliftoff-0.5.0/x86_64-alt-linux/meson-logs/testlog.txt
FAILED: meson-internal__test
/usr/bin/meson test --no-rebuild --print-errorlogs
mumps-5.3.5-alt3
/usr/lib64/openmpi/bin/mpicc -shared graph.o gbipart.o gbisect.o ddcreate.o ddbisect.o
nestdiss.o multisector.o gelim.o bucket.o tree.o symbfac.o interface.o sort.o minpriority.o
-Wl,-soname,libpord-5.3.so -o libpord-5.3.so -Wl,--as-needed,-rpath,/usr/lib64/openmpi/lib
-L/usr/lib64/openmpi/lib -Wl,-z,defs
lto1: internal compiler error: resolution sub id 0xd789be2f29659806 not in object file
libbacktrace could not find executable to open
--
See <http://bugzilla.altlinux.org> for instructions.
lto-wrapper: fatal error: x86_64-alt-linux-gcc returned 1 exit status
compilation terminated.
ld: error: lto-wrapper failed
collect2: error: ld returned 1 exit status
make[2]: *** [Makefile:34: libpord.so] Error 1
pdfmixtool-1.1.1-alt2.1
/usr/src/RPM/BUILD/pdfmixtool-1.1.1/src/operations/extract_images.cpp: In lambda function:
/usr/src/RPM/BUILD/pdfmixtool-1.1.1/src/operations/extract_images.cpp:170:29: error:
'PointerHolder' was not declared in this scope
170 | PointerHolder<Buffer> buffer =
obj.getStreamData(qpdf_dl_all);
/usr/src/RPM/BUILD/pdfmixtool-1.1.1/src/operations/extract_images.cpp:170:49: error:
expected primary-expression before '>' token
170 | PointerHolder<Buffer> buffer =
obj.getStreamData(qpdf_dl_all);
/usr/src/RPM/BUILD/pdfmixtool-1.1.1/src/operations/extract_images.cpp:170:51: error:
'buffer' was not declared in this scope; did you mean 'Buffer'?
170 | PointerHolder<Buffer> buffer =
obj.getStreamData(qpdf_dl_all);
| Buffer
/usr/src/RPM/BUILD/pdfmixtool-1.1.1/src/operations/extract_images.cpp:175:85: error:
no matching function for call to 'Magick::Blob::Blob(<brace-enclosed initializer list>)'
175 | Magick::Blob blob{buffer->getBuffer(),
buffer->getSize()};
python3-module-devpi-server-6.14.0-alt1
2025-03-11 04:29:15,842 INFO [ASYN] Starting asyncio event loop
2025-03-11 04:29:15,842 ERROR [REP] error
fetching http://localhost/+changelog/0-?initial_fetch:
requests.exceptions.ConnectionError: HTTPConnectionPool(host='localhost',
port=80): Max retries exceeded with url: /+changelog/0-?initial_fetch (Caused by
NewConnectionError('<urllib3.connection.HTTPConnection object at 0x7f855e118d40>:
Failed to establish a new connection: [Errno 111] Connection refused'))
------------------------------ Captured log setup ------------------------------
--
INFO root:log.py:70 [ASYN] Starting asyncio event loop
ERROR root:log.py:77 [REP] error fetching http://localhost/+changelog/0-?initial_fetch:
requests.exceptions.ConnectionError: HTTPConnectionPool(host='localhost',
port=80): Max retries exceeded with url: /+changelog/0-?initial_fetch (Caused by
NewConnectionError('<urllib3.connection.HTTPConnection object at 0x7f855e118d40>:
Failed to establish a new connection: [Errno 111] Connection refused'))
----------------------------- Captured stdout call -----------------------------
--
--------------------------- Captured stdout teardown ---------------------------
2025-03-11 04:29:15,847 ERROR [REP] error
fetching http://localhost/+changelog/0?initial_fetch:
requests.exceptions.ConnectionError: HTTPConnectionPool(host='localhost',
port=80): Max retries exceeded with url: /+changelog/0?initial_fetch (Caused by
NewConnectionError('<urllib3.connection.HTTPConnection object at 0x7f855d53c290>:
Failed to establish a new connection: [Errno 111] Connection refused'))
2025-03-11 04:29:15,847 INFO [ASYN] The asyncio event loop stopped
--
---------------------------- Captured log teardown -----------------------------
ERROR root:log.py:77 [REP] error fetching http://localhost/+changelog/0?initial_fetch:
requests.exceptions.ConnectionError: HTTPConnectionPool(host='localhost',
port=80): Max retries exceeded with url: /+changelog/0?initial_fetch (Caused by
NewConnectionError('<urllib3.connection.HTTPConnection object at 0x7f855d53c290>:
Failed to establish a new connection: [Errno 111] Connection refused'))
INFO root:log.py:70 [ASYN] The asyncio event loop stopped
--
----------------------------- Captured stdout call -----------------------------
2025-03-11 04:29:16,604 ERROR [REP] error
fetching http://localhost/+changelog/0-?initial_fetch:
requests.exceptions.ConnectionError: HTTPConnectionPool(host='localhost',
port=80): Max retries exceeded with url: /+changelog/0-?initial_fetch (Caused by
NewConnectionError('<urllib3.connection.HTTPConnection object at 0x7f855d39d2b0>:
Failed to establish a new connection: [Errno 111] Connection refused'))
2025-03-11 04:29:16,604 INFO NOCTX waiting for event-serial -1
--
2025-03-11 04:29:16,605 INFO [REP] fetching http://localhost/+changelog/0?initial_fetch
2025-03-11 04:29:16,606 ERROR [REP] error
fetching http://localhost/+changelog/0?initial_fetch:
requests.exceptions.ConnectionError: HTTPConnectionPool(host='localhost',
port=80): Max retries exceeded with url: /+changelog/0?initial_fetch (Caused by
NewConnectionError('<urllib3.connection.HTTPConnection object at 0x7f855d39c530>:
Failed to establish a new connection: [Errno 111] Connection refused'))
2025-03-11 04:29:16,607 INFO NOCTX waiting for event-serial -1
--
------------------------------ Captured log call -------------------------------
ERROR root:log.py:77 [REP] error fetching http://localhost/+changelog/0-?initial_fetch:
requests.exceptions.ConnectionError: HTTPConnectionPool(host='localhost',
port=80): Max retries exceeded with url: /+changelog/0-?initial_fetch (Caused by
NewConnectionError('<urllib3.connection.HTTPConnection object at 0x7f855d39d2b0>:
Failed to establish a new connection: [Errno 111] Connection refused'))
INFO root:log.py:70 NOCTX waiting for event-serial -1
--
INFO root:log.py:70 [REP] fetching http://localhost/+changelog/0?initial_fetch
ERROR root:log.py:77 [REP] error fetching http://localhost/+changelog/0?initial_fetch:
requests.exceptions.ConnectionError: HTTPConnectionPool(host='localhost',
port=80): Max retries exceeded with url: /+changelog/0?initial_fetch (Caused by
NewConnectionError('<urllib3.connection.HTTPConnection object at 0x7f855d39c530>:
Failed to establish a new connection: [Errno 111] Connection refused'))
INFO root:log.py:70 NOCTX waiting for event-serial -1
--
XPASS test_devpi_server/test_views_status.py::TestStatusInfoPlugin::test_no_primary_update
- sometimes fail due to race condition in db table creation
FAILED test_devpi_server/test_mirror.py::TestMirrorStageprojects::test_simplelinks_timeout
= 1 failed, 1074 passed, 54 skipped, 1 xfailed, 3 xpassed, 50 warnings in 432.39s
(0:07:12) =
INFO : Command's result: FAILURE
INFO : Command's error: Command '['python3', '-m', 'pytest', '-ra']' returned
non-zero exit status 1.
error: Bad exit status from /usr/src/tmp/rpm-tmp.85349 (%check)
python3-module-hypothesis-6.127.6-alt1
XPASS tests/watchdog/test_database.py::test_database_listener_directory
FAILED tests/redis/test_redis_exampledatabase.py::test_redis_listener - hypot...
= 1 failed, 6982 passed, 18 skipped, 8 xfailed, 2 xpassed in 486.51s (0:08:06) =
INFO : Command's result: FAILURE
INFO : Command's error: Command '['python3', '-m', 'pytest', '-ra', '-nauto',
'-Wignore::UserWarning:dateutil.zoneinfo', '--ignore=tests/crosshair', 'tests']'
returned non-zero exit status 1.
python3-module-schemathesis-3.39.9-alt1
> assert "Schemathesis test server is running!" in stdout
E AssertionError: assert 'Schemathesis test server is running!' in ''
/usr/src/RPM/BUILD/python3-module-schemathesis-3.39.9/test/test_app.py:42: AssertionError
--
XPASS test/contrib/test_unique_data.py::test_python_tests[None] - The
`schemathesis.contrib.unique_data` hook is deprecated
FAILED test/test_app.py::test_app[flask] - AssertionError: assert 'Schemathes...
= 1 failed, 2746 passed, 2 skipped, 4 xpassed, 331 warnings in 1049.25s (0:17:29) =
INFO : Command's result: FAILURE
INFO : Command's error: Command '['python3', '-m', 'pytest', 'test/']' returned
non-zero exit status 1.
snapd-glib-2-1.66-alt1
ok 70 /get-snap/publisher-unproven
Summary of Failures:
4/4 Tests TIMEOUT 600.16s killed by signal 15 SIGTERM
Ok: 3
Expected Fail: 0
Fail: 0
Unexpected Pass: 0
Skipped: 0
Timeout: 1
Full log written to
/usr/src/RPM/BUILD/snapd-glib-1.66/x86_64-alt-linux/meson-logs/testlog.txt
verilator-5.018-alt1
221 | struct yy_buffer_state
V3PreLex_pregen.yy.cpp:489:8: note: a different type is defined in another translation unit
489 | struct yy_buffer_state
V3Lexer_pregen.yy.cpp:227:25: note: the first difference of corresponding definitions
is field 'yy_input_file'
227 | std::streambuf* yy_input_file;
V3PreLex_pregen.yy.cpp:492:15: note: a field of same name but different type is defined
in another translation unit
492 | FILE *yy_input_file;
V3Lexer_pregen.yy.cpp:221:8: note: type name 'std::basic_streambuf<char,
std::char_traits<char> >' should match type name '_IO_FILE'
221 | struct yy_buffer_state
make[2]: Leaving directory '/usr/src/RPM/BUILD/verilator-5.018/src/obj_opt'
19 error logs REMOVED from the list
cppcheck-2.16.2-alt1_1_1f61c2e8d
deepin-movie-6.0.11-alt1
glog-0.7.1-alt1
httpie-3.2.4-alt3
kyotocabinet-1.2.76-alt3
libabseil-cpp2301.0.0-20230125.3-alt4
libgtk-engines-default-1:2.20.2-alt3.2
libkate-0.4.1-alt1.6
liboil-0.3.17-alt1.qa2
pdal-2.8.1-alt1
python-2.7.18-alt11
python3-module-cheroot-10.0.1-alt3
python3-module-hypothesis-jsonschema-0.23.1-alt1
python3-module-pytest-examples-0.0.13-alt1
python3-module-vcrpy-7.0.0-alt1
python3-module-websockets-14.1-alt1
qt6-tools-6.8.2-alt1
zig-0.13.0-alt1
zstd-1.5.5-alt2
Total 294 error logs.
Подробная информация о списке рассылки Sisyphus-cybertalk