[cyber] I: Sisyphus-20250310 x86_64 beehive_status: +12 -18 (296)
ALT beekeeper
hiver на altlinux.org
Пн Мар 10 10:25:04 MSK 2025
12 NEW error logs
Cardinal-24.12-alt1
ld: ../../carla/build/modules/Release/jackbridge.min.a: error adding symbols: archive
has no index; run ranlib to add one
collect2: error: ld returned 1 exit status
make[2]: *** [../../dpf/Makefile.plugins.mk:557: ../../bin/Cardinal] Error 1
--
ld: ../../carla/build/modules/Release/jackbridge.min.a: error adding symbols: archive
has no index; run ranlib to add one
collect2: error: ld returned 1 exit status
make[2]: *** [../../dpf/Makefile.plugins.mk:600: ../../bin/Cardinal.lv2/Cardinal.so]
Error 1
cppcheck-2.16.2-alt1_1_1f61c2e8d
cd /usr/src/RPM/BUILD/cppcheck-2.16.2/x86_64-alt-linux/lib &&
/usr/bin/c++ -DFILESDIR=\"/usr/share/Cppcheck\" -DHAVE_RULES
-I/usr/src/RPM/BUILD/cppcheck-2.16.2/x86_64-alt-linux/lib
-I/usr/src/RPM/BUILD/cppcheck-2.16.2/lib -I/usr/src/RPM/BUILD/cppcheck-2.16.2/externals
-I/usr/src/RPM/BUILD/cppcheck-2.16.2/externals/tinyxml2
-I/usr/src/RPM/BUILD/cppcheck-2.16.2/externals/picojson
-I/usr/src/RPM/BUILD/cppcheck-2.16.2/externals/simplecpp -isystem /usr/include/pcre
-pipe -frecord-gcc-switches -Wall -g -O2 -flto=auto -Wno-error=return-type -O2
-DNDEBUG -std=gnu++11 -O2 -pedantic -Wall -Wextra -Wcast-qual -Wfloat-equal
-Wmissing-declarations -Wmissing-format-attribute -Wno-long-long -Wpacked
-Wredundant-decls -Wundef -Wno-missing-field-initializers -Wno-missing-braces
-Wno-sign-compare -Wno-multichar -Woverloaded-virtual -pipe -Wno-maybe-uninitialized
-Wsuggest-attribute=noreturn -Wno-shadow -Wuseless-cast -Winvalid-pch -include
/usr/src/RPM/BUILD/cppcheck-2.16.2/x86_64-alt-linux/lib/CMakeFiles/cppcheck-core.dir/cmake_pch.hxx
-MD -MT lib/CMakeFiles/cppcheck-core.dir/build/mc_vf_settokenvalue.cpp.o
-MF CMakeFiles/cppcheck-core.dir/build/mc_vf_settokenvalue.cpp.o.d
-o CMakeFiles/cppcheck-core.dir/build/mc_vf_settokenvalue.cpp.o -c
/usr/src/RPM/BUILD/cppcheck-2.16.2/x86_64-alt-linux/lib/build/mc_vf_settokenvalue.cpp
gmake[2]: Leaving directory '/usr/src/RPM/BUILD/cppcheck-2.16.2/x86_64-alt-linux'
gmake[2]: Entering directory '/usr/src/RPM/BUILD/cppcheck-2.16.2/x86_64-alt-linux'
[ 57%] Building CXX object lib/CMakeFiles/cppcheck-core.dir/build/mc_vf_subfunction.cpp.o
cd /usr/src/RPM/BUILD/cppcheck-2.16.2/x86_64-alt-linux/lib &&
/usr/bin/c++ -DFILESDIR=\"/usr/share/Cppcheck\" -DHAVE_RULES
-I/usr/src/RPM/BUILD/cppcheck-2.16.2/x86_64-alt-linux/lib
-I/usr/src/RPM/BUILD/cppcheck-2.16.2/lib -I/usr/src/RPM/BUILD/cppcheck-2.16.2/externals
-I/usr/src/RPM/BUILD/cppcheck-2.16.2/externals/tinyxml2
-I/usr/src/RPM/BUILD/cppcheck-2.16.2/externals/picojson
-I/usr/src/RPM/BUILD/cppcheck-2.16.2/externals/simplecpp -isystem /usr/include/pcre
-pipe -frecord-gcc-switches -Wall -g -O2 -flto=auto -Wno-error=return-type -O2
-DNDEBUG -std=gnu++11 -O2 -pedantic -Wall -Wextra -Wcast-qual -Wfloat-equal
-Wmissing-declarations -Wmissing-format-attribute -Wno-long-long -Wpacked
-Wredundant-decls -Wundef -Wno-missing-field-initializers -Wno-missing-braces
-Wno-sign-compare -Wno-multichar -Woverloaded-virtual -pipe -Wno-maybe-uninitialized
-Wsuggest-attribute=noreturn -Wno-shadow -Wuseless-cast -Winvalid-pch -include
/usr/src/RPM/BUILD/cppcheck-2.16.2/x86_64-alt-linux/lib/CMakeFiles/cppcheck-core.dir/cmake_pch.hxx
-MD -MT lib/CMakeFiles/cppcheck-core.dir/build/mc_vf_subfunction.cpp.o
-MF CMakeFiles/cppcheck-core.dir/build/mc_vf_subfunction.cpp.o.d
-o CMakeFiles/cppcheck-core.dir/build/mc_vf_subfunction.cpp.o -c
/usr/src/RPM/BUILD/cppcheck-2.16.2/x86_64-alt-linux/lib/build/mc_vf_subfunction.cpp
gmake[2]: Leaving directory '/usr/src/RPM/BUILD/cppcheck-2.16.2/x86_64-alt-linux'
gmake[1]: Entering directory '/usr/src/RPM/BUILD/cppcheck-2.16.2/x86_64-alt-linux'
[ 58%] Built target cppcheck-core
gmake[1]: Leaving directory '/usr/src/RPM/BUILD/cppcheck-2.16.2/x86_64-alt-linux'
gmake: *** [Makefile:146: all] Error 2
glog-0.7.1-alt1
26/26 Test #26: dcheck_off .......................***Not Run (Disabled) 0.00 sec
96% tests passed, 1 tests failed out of 23
Total Test time (real) = 17.93 sec
--
26 - dcheck_off (Disabled)
The following tests FAILED:
2 - logging (SIGPIPE)
gnome-connections-47.2.1-alt1
../subprojects/gtk-frdp/src/frdp-session.c: In function Б─≤frdp_session_send_keyБ─≥:
../subprojects/gtk-frdp/src/frdp-session.c:1544:5: error: implicit declaration of function
Б─≤freerdp_keyboard_get_rdp_scancode_from_x11_keycodeБ─≥ [-Wimplicit-function-declaration]
1544 | freerdp_keyboard_get_rdp_scancode_from_x11_keycode (key->hardware_keycode);
httpie-3.2.4-alt3
=========================== short test summary info ============================
FAILED tests/test_uploads.py::test_stdin_read_warning - AssertionError: asser...
= 1 failed, 965 passed, 33 skipped, 25 deselected, 4 xfailed, 137 warnings in 86.31s
(0:01:26) =
INFO : Command's result: FAILURE
INFO : Command's error: Command '['python3', '-m', 'pytest', '-m', 'not
requires_installation']' returned non-zero exit status 1.
kyotocabinet-1.2.76-alt3
error
FAILED: KCRNDSEED=2121242276 PID=2805540 ./kcdirtest queue -th 4 -it 4 casket 500
make[1]: *** [Makefile:551: check-dir] Error 1
liboil-0.3.17-alt1.qa2
PASS: proto4
FAIL: stride
PASS: dso_check
--
# SKIP: 0
# XFAIL: 0
# FAIL: 1
# XPASS: 0
# ERROR: 0
See testsuite/test-suite.log
python-2.7.18-alt11
self._sslobj.do_handshake()
SSLZeroReturnError: TLS/SSL connection has been closed (EOF) (_ssl.c:735)
Exception in thread Thread-75:
--
self._sslobj.do_handshake()
SSLZeroReturnError: TLS/SSL connection has been closed (EOF) (_ssl.c:735)
Exception in thread Thread-76:
--
self._sslobj.do_handshake()
SSLZeroReturnError: TLS/SSL connection has been closed (EOF) (_ssl.c:735)
Exception in thread Thread-77:
--
self._sslobj.do_handshake()
SSLZeroReturnError: TLS/SSL connection has been closed (EOF) (_ssl.c:735)
Exception in thread Thread-78:
--
self._sslobj.do_handshake()
SSLZeroReturnError: TLS/SSL connection has been closed (EOF) (_ssl.c:735)
Exception in thread Thread-79:
--
self._sslobj.do_handshake()
SSLZeroReturnError: TLS/SSL connection has been closed (EOF) (_ssl.c:735)
Exception in thread Thread-80:
--
self._sslobj.do_handshake()
SSLZeroReturnError: TLS/SSL connection has been closed (EOF) (_ssl.c:735)
Warning -- asyncore.socket_map was modified by test_ftplib
python3-module-hypothesis-jsonschema-0.23.1-alt1
assert is_valid(instance, schema) == is_valid(instance, cc)
E AssertionError: assert False == True
E + where False = is_valid(-9007199254741149, {'maximum': 0, 'multipleOf': 99.0,
'type': 'integer'})
--
assert make_validator(schema).is_valid(value)
E AssertionError: assert False
E + where False = is_valid(-9007199254741149)
--
=========================== short test summary info ============================
FAILED
tests/test_canonicalise.py::test_canonicalises_to_equivalent_fixpoint[integer-schema]
FAILED tests/test_from_schema.py::test_generated_data_matches_schema[integer-schema]
= 2 failed, 859 passed, 59 skipped, 109 xfailed, 2 xpassed in 1313.05s (0:21:53) =
INFO : Command's result: FAILURE
INFO : Command's error: Command '['python3', '-m', 'pytest', '-n', 'auto']' returned
non-zero exit status 1.
remmina-1.4.37-alt1
gmake[1]: Leaving directory '/usr/src/RPM/BUILD/remmina-1.4.37/x86_64-alt-linux'
gmake[2]: Entering directory '/usr/src/RPM/BUILD/remmina-1.4.37/x86_64-alt-linux'
[ 22%] Linking C shared module remmina-plugin-python_wrapper.so
cd /usr/src/RPM/BUILD/remmina-1.4.37/x86_64-alt-linux/plugins/python_wrapper &&
/usr/bin/cmake -E cmake_link_script CMakeFiles/remmina-plugin-python_wrapper.dir/link.txt
--verbose=1
/usr/bin/cc -fPIC -pipe -frecord-gcc-switches -Wall -g -O2 -flto=auto
-Werror=incompatible-pointer-types -fPIC -Wall -Wno-unused-result
-Wno-unused-but-set-variable -Wno-deprecated-declarations
-Wimplicit-function-declaration -Wredundant-decls -O2 -DNDEBUG
-Wl,--dependency-file=CMakeFiles/remmina-plugin-python_wrapper.dir/link.d
-shared -o remmina-plugin-python_wrapper.so
"CMakeFiles/remmina-plugin-python_wrapper.dir/python_wrapper_common.c.o"
"CMakeFiles/remmina-plugin-python_wrapper.dir/python_wrapper_entry.c.o"
"CMakeFiles/remmina-plugin-python_wrapper.dir/python_wrapper_file.c.o"
"CMakeFiles/remmina-plugin-python_wrapper.dir/python_wrapper_plugin.c.o"
"CMakeFiles/remmina-plugin-python_wrapper.dir/python_wrapper_pref.c.o"
"CMakeFiles/remmina-plugin-python_wrapper.dir/python_wrapper_protocol.c.o"
"CMakeFiles/remmina-plugin-python_wrapper.dir/python_wrapper_protocol_widget.c.o"
"CMakeFiles/remmina-plugin-python_wrapper.dir/python_wrapper_remmina.c.o"
"CMakeFiles/remmina-plugin-python_wrapper.dir/python_wrapper_remmina_file.c.o"
"CMakeFiles/remmina-plugin-python_wrapper.dir/python_wrapper_secret.c.o"
"CMakeFiles/remmina-plugin-python_wrapper.dir/python_wrapper_tool.c.o"
/usr/lib64/libgtk-3.so /usr/lib64/libgdk-3.so /usr/lib64/libgdk_pixbuf-2.0.so
/usr/lib64/libpango-1.0.so /usr/lib64/libcairo.so /usr/lib64/libgobject-2.0.so
/usr/lib64/libglib-2.0.so /usr/lib64/libgio-2.0.so /usr/lib64/libgmodule-2.0.so
-lwayland-client /usr/lib64/libpython3.12.so
gmake[2]: Leaving directory '/usr/src/RPM/BUILD/remmina-1.4.37/x86_64-alt-linux'
gmake[1]: Entering directory '/usr/src/RPM/BUILD/remmina-1.4.37/x86_64-alt-linux'
[ 22%] Built target remmina-plugin-python_wrapper
gmake[1]: Leaving directory '/usr/src/RPM/BUILD/remmina-1.4.37/x86_64-alt-linux'
gmake: *** [Makefile:136: all] Error 2
zig-0.13.0-alt1
/usr/bin/gmake -f CMakeFiles/stage3.dir/build.make CMakeFiles/stage3.dir/build
hasher-privd: parent: handle_io: idle time limit (3600 seconds) exceeded
zstd-1.5.5-alt2
test206 : ZSTD_adjustCParams() + dictionary OK
test207 : check compression mem usage monotonicity over levels for estimateCCtxSize() : OK
test208 : check estimateCCtxSize() always larger or equal to
ZSTD_estimateCCtxSize_usingCParams() : OK
test209 : thread pool API tests :
thread pool test : threadPool re-use roundtrips: OK
thread pool test : threadPool simultaneous usage: OK
thread pool tests OK
1
6
15
16
19
36
39
58
66
77
86
90
107
120
133
134
148
170
185
197
209
219
224
228
238
252
257
259
267
279
290
303
304
316
320
339
363
372
375
384
387
394
410
417
433
438
456
458
464
473
488
504
520
540
542
564
570
589
597
604
623
649
656
662
675
696
706
725
742
753
776
777
788
791
798
804
814
819
836
848
850
861
877
893
901
903
914
926
932
939
952
954
961
978
995
1001
1003
1011
1016
1023
1028
1041
1052
1069
1073
1082
1095
1108
1127
1137
1150
1162
1181
1189
1202
1219
1243
1249
1263
1278
1282
1288
1299
1307
1323
1324
1333
1348
1368
1371
1389
1396
1399
1409
1412
1426
1443
1449
1451
1458
1469
1477
1486
1488
1490
1496
1498
1511
1513
1524
1525
1531
1533
1543
1549
1565
1586
1601
1605
1607
1620
1628
1632
1636
1642
1646
1658
1663
1678
1691
1705
1712
1735
1753
1776
1778
1789
1798
1810
1827
1849
1853
1861
1878
1881
1888
1892
1896
1900
1912
1916
1927
1954
1966
1977
1980
1990
2005
2014
2021
2028
2039
2048
2062
2077
2084
2098
2108
2118
2127
2136
2138
2159
2166
2175
2178
2186
2191
2206
2208
2229
2232
2239
2253
2258
2263
2274
2280
2297
2310
2319
2336
2346
2357
2374
2381
2401
2416
2422
2438
2452
make: Leaving directory '/usr/src/RPM/BUILD/zstd-1.5.5-alt2/tests'
make: Target 'test' not remade because of errors.
18 error logs REMOVED from the list
blender-4.3.0-alt4
blender4.4-4.4.0-alt0.7.g416085d893a
gnome-bluetooth3.0-47.1-alt1
libgda6-6.0.0-alt2
libliftoff-0.5.0-alt1
libpari23-2.3.5-alt1_18
llvm17.0-17.0.6-alt4.3
mumps-5.3.5-alt3
php8.3-memcache-8.2-alt8.3.17.alt1
plank-0.11.89-alt2
python3-module-easyprocess-1.1-alt2
python3-module-eventlet-0.39.1-alt1
python3-module-pyshark-0.6-alt2
python3-module-terminado-0.18.1-alt1
python3-module-xonsh-0.19.2-alt1
python3-module-zmq-26.2.1-alt1
redis-7.2.7-alt1
vaultwarden-1.33.2-alt2
Total 296 error logs.
Подробная информация о списке рассылки Sisyphus-cybertalk