[cyber] I: p10-20250309 x86_64 beehive_status: +4 -6 (78)
ALT beekeeper
hiver на altlinux.org
Вс Мар 9 20:23:46 MSK 2025
4 NEW error logs
guile-ncurses-3.0-alt1
PASS: menu_equal.scm
FAIL: menu_gc_refcount.scm
PASS: menu_gc_refcount_2.scm
--
# SKIP: 31
# XFAIL: 0
# FAIL: 1
# XPASS: 0
# ERROR: 0
See test/test-suite.log
pcre2-10.42-alt1
PASS: RunTest
FAIL: RunGrepTest
Testsuite summary for PCRE2 10.42
--
# SKIP: 0
# XFAIL: 0
# FAIL: 1
# XPASS: 0
# ERROR: 0
See ./test-suite.log
python3-module-pytest-httpbin-2.0.0-alt1
is not None
E AssertionError: assert None is not None
E + where None = <function match at 0x7f2d975f6d30>('pytest-httpbin server hit
an exception serving request: .* The handshake operation timed out\nattempting to ignore
so the rest of the tests can run\n', '')
--
=========================== short test summary info ============================
FAILED tests/test_server.py::test_dont_crash_on_handshake_timeout - Assertion...
========================= 1 failed, 20 passed in 3.32s =========================
INFO : Command's result: FAILURE
INFO : Command's error: Command '['python3', '-m', 'pytest', '-ra', '-Wignore']'
returned non-zero exit status 1.
error: Bad exit status from /usr/src/tmp/rpm-tmp.68268 (%check)
texlive-texmf-2021-alt1_4
/usr/src/tmp/texlive-texmf-buildroot/usr/share/texmf-dist/scripts/texlive/tlmgrgui.pl
syntax OK
Can't exec "%COMSPEC%": No such file or directory at
/usr/src/tmp/texlive-texmf-buildroot/usr/share/texmf-dist/scripts/texlive/uninstall-win32.pl
line 11.
Use of uninitialized value $Master in scalar chomp at
/usr/src/tmp/texlive-texmf-buildroot/usr/share/texmf-dist/scripts/texlive/uninstall-win32.pl
line 12.
--
/usr/src/tmp/texlive-texmf-buildroot/usr/share/texmf-dist/scripts/thumbpdf/thumbpdf.pl
syntax OK
Can't exec "%COMSPEC%": No such file or directory at
/usr/src/tmp/texlive-texmf-buildroot/usr/share/texmf-dist/scripts/tlaunch/tlaunchmode.pl
line 9.
Use of uninitialized value $Master in scalar chomp at
/usr/src/tmp/texlive-texmf-buildroot/usr/share/texmf-dist/scripts/tlaunch/tlaunchmode.pl
line 10.
--
find-provides: running scripts (alternatives,debuginfo,lib,pam,perl,pkgconfig,shell,tex)
hasher-privd: parent: handle_io: idle time limit (3600 seconds) exceeded
6 error logs REMOVED from the list
atlas-3.9.35-alt1.qa1
gretl-2022c-alt1
python3-module-pyshark-0.6-alt1
python3-module-watchdog-2.1.3-alt1
python3-module-websockets-12.0-alt0.p10.1
rng-tools-6.14-alt1.git82f665c4
Total 78 error logs.
Подробная информация о списке рассылки Sisyphus-cybertalk