[cyber] I: p11-20250302 x86_64 beehive_status: +27 -10 (113)

ALT beekeeper hiver ÎÁ altlinux.org
÷Ó íÁÒ 2 09:03:11 MSK 2025


	27 NEW error logs

authenticator-4.5.0-alt1
	Compiling gstreamer-pbutils-sys v0.23.0
	Summary of Failures:
	4/4 Cargo tests		   TIMEOUT	  1200.28s   killed by signal 15 SIGTERM
	Ok:		    3
	Expected Fail:	    0
	Fail:		    0
	Unexpected Pass:    0
	Skipped:	    0
	Timeout:	    1
	Full log written to
	/usr/src/RPM/BUILD/authenticator-4.5.0/x86_64-alt-linux/meson-logs/testlog.txt

casr-2.12.1-alt1
	test test_casr_libfuzzer has been running for over 60 seconds
	test test_casr_libfuzzer ... FAILED
	failures:
	--
	test_casr_libfuzzer
	test result: FAILED. 55 passed; 1 failed; 5 ignored; 0 measured; 37 filtered out;
	finished in 132.51s
	error: test failed, to rerun pass `-p casr --test tests`

converseen-0.12.2.3-alt1
	-- Found WrapVulkanHeaders: /usr/include
	-- Found ImageMagick: /usr/lib64/libMagick++-7.Q16HDRI.so (found version "7.1.1-41")
	CMake Error at /usr/lib64/cmake/Qt6Core/Qt6CoreMacros.cmake:262 (message):
	qt6_wrap_cpp: TARGET parameter is empty.  Since the file
	/usr/src/RPM/BUILD/converseen-0.12.2.3/src/magickdefine.cpp is a source
	file, the TARGET option must be specified.
	Call Stack (most recent call first):
	/usr/lib64/cmake/Qt6Core/Qt6CoreMacros.cmake:186 (_qt_internal_wrap_cpp)
	CMakeLists.txt:117 (qt6_wrap_cpp)
	-- Configuring incomplete, errors occurred!

digikam-8.4.0-alt3
	from /usr/src/RPM/BUILD/digikam-8.4.0/core/libs/dimg/dimg_p.h:59,
	from /usr/src/RPM/BUILD/digikam-8.4.0/core/libs/dimg/dimg_transform.cpp:17:
	/usr/include/KF6/KI18n/klocalizedcontext.h:43:20: warning: attribute ignored in
	declaration of ‘class KLocalizedContext’ [-Wattributes]
	43 | class KI18N_EXPORT KLocalizedContext : public QObject
	/usr/include/KF6/KI18n/klocalizedcontext.h:43:20: note: attribute for ‘class
	KLocalizedContext’ must follow the ‘class’ keyword
	make[2]: Leaving directory '/usr/src/RPM/BUILD/digikam-8.4.0/BUILD'
	make[1]: Entering directory '/usr/src/RPM/BUILD/digikam-8.4.0/BUILD'
	[ 19%] Built target core_dimg_obj
	make[1]: Leaving directory '/usr/src/RPM/BUILD/digikam-8.4.0/BUILD'
	make: *** [Makefile:139: all] Error 2

fcitx5-qt-5.1.1-alt1_3
	-- Detecting CXX compile features - done
	Package xau was not found in the pkg-config search path.
	Perhaps you should add the directory containing `xau.pc'
	to the PKG_CONFIG_PATH environment variable
	Package 'xau', required by 'xcb', not found
	Package xau was not found in the pkg-config search path.
	Perhaps you should add the directory containing `xau.pc'
	to the PKG_CONFIG_PATH environment variable
	Package 'xau', required by 'xcb', not found
	Package xau was not found in the pkg-config search path.
	Perhaps you should add the directory containing `xau.pc'
	to the PKG_CONFIG_PATH environment variable
	Package 'xau', required by 'xcb', not found
	Package xau was not found in the pkg-config search path.
	Perhaps you should add the directory containing `xau.pc'
	to the PKG_CONFIG_PATH environment variable
	Package 'xau', required by 'xcb', not found
	-- Found XCB_XCB: /usr/lib64/libxcb.so (found version "1.17.0")
	--
	[32/90] /usr/bin/c++ -DFCITX5_QT_VERSION=\"5.1.1\" -DFCITX_GETTEXT_DOMAIN=\"fcitx5-qt\"
	-DQT_CORE_LIB -DQT_GUI_LIB -DQT_NO_DEBUG -DQT_NO_KEYWORDS -I/usr/include/qt6/QtGui/6.8.2
	-I/usr/include/qt6/QtGui/6.8.2/QtGui -I/usr/include/qt6/QtCore/6.8.2
	-I/usr/include/qt6/QtCore/6.8.2/QtCore -I/usr/include/qt6/QtDBus/6.8.2
	-I/usr/include/qt6/QtDBus/6.8.2/QtDBus -isystem /usr/include/qt6/QtGui
	-isystem /usr/include/qt6 -isystem /usr/include/qt6/QtCore -isystem
	/usr/lib64/qt6/mkspecs/linux-g++ -Wall -Wextra -pipe -frecord-gcc-switches -Wall
	-g -O2 -flto=auto -std=c++17 -fvisibility=hidden -fvisibility-inlines-hidden -MD
	-MT qt6/immodule-probing/CMakeFiles/fcitx5-qt6-immodule-probing.dir/main.cpp.o
	-MF qt6/immodule-probing/CMakeFiles/fcitx5-qt6-immodule-probing.dir/main.cpp.o.d
	-o qt6/immodule-probing/CMakeFiles/fcitx5-qt6-immodule-probing.dir/main.cpp.o -c
	/usr/src/RPM/BUILD/fcitx5-qt-5.1.1/qt6/immodule-probing/main.cpp
	FAILED: qt6/immodule-probing/CMakeFiles/fcitx5-qt6-immodule-probing.dir/main.cpp.o
	/usr/bin/c++ -DFCITX5_QT_VERSION=\"5.1.1\" -DFCITX_GETTEXT_DOMAIN=\"fcitx5-qt\"
	-DQT_CORE_LIB -DQT_GUI_LIB -DQT_NO_DEBUG -DQT_NO_KEYWORDS -I/usr/include/qt6/QtGui/6.8.2
	-I/usr/include/qt6/QtGui/6.8.2/QtGui -I/usr/include/qt6/QtCore/6.8.2
	-I/usr/include/qt6/QtCore/6.8.2/QtCore -I/usr/include/qt6/QtDBus/6.8.2
	-I/usr/include/qt6/QtDBus/6.8.2/QtDBus -isystem /usr/include/qt6/QtGui
	-isystem /usr/include/qt6 -isystem /usr/include/qt6/QtCore -isystem
	/usr/lib64/qt6/mkspecs/linux-g++ -Wall -Wextra -pipe -frecord-gcc-switches -Wall
	-g -O2 -flto=auto -std=c++17 -fvisibility=hidden -fvisibility-inlines-hidden -MD
	-MT qt6/immodule-probing/CMakeFiles/fcitx5-qt6-immodule-probing.dir/main.cpp.o
	-MF qt6/immodule-probing/CMakeFiles/fcitx5-qt6-immodule-probing.dir/main.cpp.o.d
	-o qt6/immodule-probing/CMakeFiles/fcitx5-qt6-immodule-probing.dir/main.cpp.o -c
	/usr/src/RPM/BUILD/fcitx5-qt-5.1.1/qt6/immodule-probing/main.cpp
	/usr/src/RPM/BUILD/fcitx5-qt-5.1.1/qt6/immodule-probing/main.cpp: In function 'int
	main(int, char**)':
	/usr/src/RPM/BUILD/fcitx5-qt-5.1.1/qt6/immodule-probing/main.cpp:19:60: error: 'using
	QStringList = class QList<QString>' {aka 'class QList<QString>'} has no member named
	'toStdString'
	19 |		   << QPlatformInputContextFactory::requested().toStdString()

fprintd-1.94.4-alt3
	531/531 fprintd:dist / check-translations
	OK		0.25s
	Summary of Failures:
	262/531 fprintd:daemon+fprintd+FPrintdVirtualDeviceStorageClaimedTest /
	FPrintdVirtualDeviceStorageClaimedTest.test_delete_with_no_enrolled_prints
	TIMEOUT        30.11s	exit status 1
	Ok:		    530
	Expected Fail:	    0
	Fail:		    0
	Unexpected Pass:    0
	Skipped:	    0
	Timeout:	    1
	Full log written to
	/usr/src/RPM/BUILD/fprintd-1.94.4/x86_64-alt-linux/meson-logs/testlog.txt

goldendict-ng-24.05.05-alt1
	/usr/src/RPM/BUILD/goldendict-ng-24.05.05/src/multimediaaudioplayer.cc: In member function
	'void MultimediaAudioPlayer::audioOutputChange()':
	/usr/src/RPM/BUILD/goldendict-ng-24.05.05/src/multimediaaudioplayer.cc:39:9: error:
	invalid use of incomplete type 'class QDebug'
	39 |   qDebug() << "audio device changed";
	--
	/usr/src/RPM/BUILD/goldendict-ng-24.05.05/src/multimediaaudioplayer.cc: In lambda function:
	/usr/src/RPM/BUILD/goldendict-ng-24.05.05/src/multimediaaudioplayer.cc:79:13: error:
	invalid use of incomplete type 'class QDebug'
	79 |	 qWarning() << "Error while playing audio from memory "<< errorString;

guile22-2.2.7-alt1
	make[2]: Leaving directory '/usr/src/RPM/BUILD/guile22-2.2.7/bootstrap'
	hasher-privd: parent: handle_io: idle time limit (3600 seconds) exceeded

kalzium-24.08.2-alt1
	/usr/src/RPM/BUILD/kalzium-24.08.2/src/calculator/nuclearCalculator.cpp: In member
	function ‘void nuclearCalculator::isotopeChanged(int)’:
	/usr/src/RPM/BUILD/kalzium-24.08.2/src/calculator/nuclearCalculator.cpp:179:64: error:
	‘class QString’ has no member named ‘operator==’; did you mean ‘operator=’?
	179 |	  int halfLifeUnit = (list.at(index)->halflifeUnit().operator==("y"))
	? KUnitConversion::Year : KUnitConversion::Second;

kyotocabinet-1.2.76-alt3
	error
	FAILED: KCRNDSEED=1427826643 PID=3714978 ./kcdirtest queue -th 4 -it 4 casket 500
	make[1]: *** [Makefile:551: check-dir] Error 1

perl-Net-SIP-0.836-alt1
	t/18_register_with_auth_step_by_step.t .. ok
	#   Failed test '[uac] got rtp packet#100'
	#   at ./t/testlib.pl line 234.
	#   Failed test 'fatal error at ./t/testlib.pl line 235.
	#   at ./t/testlib.pl line 31.
	--
	t/20_channel_on_hold.t		      (Wstat: 256 (exited 1) Tests: 46 Failed: 2)
	Failed tests:  45-46
	Non-zero exit status: 1
	--
	Result: FAIL
	Failed 1/23 test programs. 2/1741 subtests failed.
	make: *** [Makefile:829: test_dynamic] Error 255

pg_rman13-1.3.16-alt2
	postgresql13-server-devel: Depends: libecpg6-13-devel (= 13.20-alt1:p11+375277.200.2.1)
	E: Broken packages
	hsh-install: Failed to calculate package file list.

pg_rman14-1.3.16-alt2
	postgresql14-server-devel: Depends: libecpg6-14-devel (= 14.17-alt1:p11+375277.300.2.1)
	E: Broken packages
	hsh-install: Failed to calculate package file list.

pg_rman15-1.3.16-alt2
	postgresql15-server-devel: Depends: libecpg6-15-devel (= 15.12-alt1:p11+375277.400.2.1)
	E: Broken packages
	hsh-install: Failed to calculate package file list.

pg_rman16-1.3.16-alt2
	postgresql16-server-devel: Depends: libecpg6-16-devel (= 16.8-alt1:p11+375277.500.2.1)
	E: Broken packages
	hsh-install: Failed to calculate package file list.

postgresql13-repmgr-5.4.1-alt3
	postgresql13-server-devel: Depends: libecpg6-13-devel (= 13.20-alt1:p11+375277.200.2.1)
	E: Broken packages
	hsh-install: Failed to calculate package file list.

postgresql14-repmgr-5.4.1-alt3
	postgresql14-server-devel: Depends: libecpg6-14-devel (= 14.17-alt1:p11+375277.300.2.1)
	E: Broken packages
	hsh-install: Failed to calculate package file list.

postgresql15-repmgr-5.4.1-alt3
	postgresql15-server-devel: Depends: libecpg6-15-devel (= 15.12-alt1:p11+375277.400.2.1)
	E: Broken packages
	hsh-install: Failed to calculate package file list.

postgresql16-repmgr-5.4.1-alt3
	postgresql16-server-devel: Depends: libecpg6-16-devel (= 16.8-alt1:p11+375277.500.2.1)
	E: Broken packages
	hsh-install: Failed to calculate package file list.

python3-module-asyncpg-0.29.0-alt2
	tests/test_execute.py::TestExecuteMany::test_executemany_server_failure_after_writes PASSED
	tests/test_execute.py::TestExecuteMany::test_executemany_server_failure_during_writes
	FAILED
	tests/test_execute.py::TestExecuteMany::test_executemany_timeout PASSED
	--
	raise self.failureException(msg)
	AssertionError: 128 not less than 128 : should stop early
	=========================== short test summary info ============================
	--
	SKIPPED [1] tests/test__sourcecode.py:19: flake8 module is missing
	FAILED
	tests/test_execute.py::TestExecuteMany::test_executemany_server_failure_during_writes
	============= 1 failed, 302 passed, 3 skipped in 69.32s (0:01:09) ==============
	INFO	 : Command's result: FAILURE
	INFO	 : Command's error: Command '['pytest', '-vra', './tests']' returned non-zero
	exit status 1.

python3-module-paramiko-3.4.0-alt1
	self.transport._send_user_message(m)
	AttributeError: 'NoneType' object has no attribute '_send_user_message'
	warnings.warn(pytest.PytestUnraisableExceptionWarning(msg))
	--
	=========================== short test summary info
	============================
	FAILED
	tests/test_transport.py::TestStrictKex::test_sequence_numbers_reset_on_newkeys_when_strict
	- assert 0 == 1
	= 1 failed, 507 passed, 14 skipped, 54
	deselected, 2 xfailed, 4 warnings in 19.12s
	=
	INFO	 : Command's result: FAILURE
	INFO	 : Command's error: Command '['inv', 'test']' returned non-zero exit status 1.

python3-module-pulsectl-asyncio-1.2.2-alt1
	tests/test_async_with_dummy_instance.py::AsyncDummyTests::test_ext_stream_restore PASSED
	[ 29%]
	tests/test_async_with_dummy_instance.py::AsyncDummyTests::test_get_peak_sample FAILED
	[ 35%]
	tests/test_async_with_dummy_instance.py::AsyncDummyTests::test_get_sink_src PASSED [ 41%]
	--
	>			self.assertGreater(peak, 0)
	E      AssertionError: 0.0 not greater than 0
	tests/test_async_with_dummy_instance.py:463: AssertionError
	--
	=========================== short test summary info ============================
	FAILED tests/test_async_with_dummy_instance.py::AsyncDummyTests::test_get_peak_sample
	=================== 1 failed, 16 passed, 1 warning in 20.88s ===================
	ERROR: InvocationError for command
	/usr/src/RPM/BUILD/python3-module-pulsectl-asyncio-1.2.2/.tox/py3/bin/pytest -vra
	(exited with code 1)
	py3 finish: run-test  after 21.21 seconds
	--
	___________________________________ summary ____________________________________
	ERROR:	 py3: commands failed
	cleanup
	/usr/src/RPM/BUILD/python3-module-pulsectl-asyncio-1.2.2/.tox/.tmp/package/1/pulsectl_asyncio-1.2.2-py3-none-any.whl

python3-module-pyshark-0.6-alt2
	==================================== ERRORS ====================================
	_________________ ERROR at teardown of test_sum_lengths[True] __________________
	request = <SubRequest 'simple_xml_and_json_capture' for <Function test_sum_lengths[True]>>
	--
	return await asyncio.wait_for(process.wait(), 1)
	except asyncTimeoutError:
	self._log.debug(
	"Waiting for process to close failed, may have zombie process.")
	except ProcessLookupError:
	pass
	except OSError:
	if os.name != "nt":
	--
	raise RuntimeError('This event loop is already running')
	RuntimeError: This event loop is already running
	warnings.warn(pytest.PytestUnraisableExceptionWarning(msg))
	--
	=========================== short test summary info ============================
	ERROR ../tests/test_basic_parsing.py::test_sum_lengths[True] - pyshark.captur...
	================== 73 passed, 123 warnings, 1 error in 20.75s ==================
	ERROR: InvocationError for command
	/usr/src/RPM/BUILD/python3-module-pyshark-0.6/src/.tox/py3/bin/pytest .. -s (exited
	with code 1)
	py3 finish: run-test  after 20.99 seconds
	--
	___________________________________ summary ____________________________________
	ERROR:	 py3: commands failed
	cleanup
	/usr/src/RPM/BUILD/python3-module-pyshark-0.6/src/.tox/.tmp/package/1/pyshark-0.6-py3-none-any.whl

python3-module-websockets-12.0-alt1
	raise ValueError("Invalid file descriptor: {}".format(fd))
	ValueError: Invalid file descriptor: -1
	....................................................................................................................s..............................................................................................................................................................................................................................................................................................................................................................................
	FAIL: test_close_timeout_waiting_for_recv
	(tests.sync.test_connection.ServerConnectionTests.test_close_timeout_waiting_for_recv)
	Traceback (most recent call last):
	--
	self.assertFalse(close_thread.is_alive())
	AssertionError: True is not false
	Ran 1297 tests in 3.411s
	FAILED (failures=1, skipped=12)
	INFO	 : Command's result: FAILURE
	INFO	 : Command's error: Command '['python3', '-m', 'unittest']' returned non-zero
	exit status 1.

qt6-tools-6.8.2-alt1
	from /usr/src/tmp/qt6-tools-buildroot/usr/include/qt6/QtHelp/qhelplink.h:9:
	/usr/include/qt6/QtCore/qatomic_cxx11.h:10:10: fatal error: atomic: No such file or
	directory
	10 | #include <atomic>
	--
	cpp.req: /usr/src/tmp/qt6-tools-buildroot/usr/include/qt6/QtHelp/qhelplink.h: cpp failed,
	trying c++ mode
	/usr/src/tmp/qt6-tools-buildroot/usr/include/qt6/QtHelp/6.8.2/QtHelp/private/qfilternamedialog_p.h:18:10:
	fatal error: ui_qfilternamedialog.h: No such file or directory
	18 | #include "ui_qfilternamedialog.h"
	--
	cpp.req: WARNING:
	/usr/src/tmp/qt6-tools-buildroot/usr/include/qt6/QtHelp/6.8.2/QtHelp/private/qfilternamedialog_p.h:
	cpp failed
	/usr/src/tmp/qt6-tools-buildroot/usr/include/qt6/QtDesigner/6.8.2/QtDesigner/private/plugindialog_p.h:18:10:
	fatal error: ui_plugindialog.h: No such file or directory
	18 | #include "ui_plugindialog.h"
	--
	cpp.req: WARNING:
	/usr/src/tmp/qt6-tools-buildroot/usr/include/qt6/QtDesigner/6.8.2/QtDesigner/private/plugindialog_p.h:
	cpp failed
	/usr/src/tmp/qt6-tools-buildroot/usr/include/qt6/QtQDocCatchConversions/catch_conversions/qdoc_catch_conversions.h:8:10:
	fatal error: qdoc/boundaries/filesystem/directorypath.h: No such file or directory
	8 | #include <qdoc/boundaries/filesystem/directorypath.h>
	--
	from
	/usr/src/tmp/qt6-tools-buildroot/usr/include/qt6/QtQDocCatchGenerators/catch_generators/generators/path_generator.h:9:
	/usr/src/tmp/qt6-tools-buildroot/usr/include/qt6/QtQDocCatchGenerators/catch_generators/generators/combinators/../../utilities/semantics/generator_handler.h:8:10:
	fatal error: catch/catch.hpp: No such file or directory
	8 | #include <catch/catch.hpp>
	--
	from
	/usr/src/tmp/qt6-tools-buildroot/usr/include/qt6/QtQDocCatchGenerators/catch_generators/generators/qchar_generator.h:8:
	/usr/src/tmp/qt6-tools-buildroot/usr/include/qt6/QtQDocCatchGenerators/catch_generators/generators/combinators/../../utilities/semantics/generator_handler.h:8:10:
	fatal error: catch/catch.hpp: No such file or directory
	8 | #include <catch/catch.hpp>
	--
	from
	/usr/src/tmp/qt6-tools-buildroot/usr/include/qt6/QtQDocCatchGenerators/catch_generators/generators/qstring_generator.h:7:
	/usr/src/tmp/qt6-tools-buildroot/usr/include/qt6/QtQDocCatchGenerators/catch_generators/generators/combinators/../../utilities/semantics/generator_handler.h:8:10:
	fatal error: catch/catch.hpp: No such file or directory
	8 | #include <catch/catch.hpp>
	--
	cpp.req: WARNING:
	/usr/src/tmp/qt6-tools-buildroot/usr/include/qt6/QtQDocCatchGenerators/catch_generators/generators/qstring_generator.h:
	cpp failed
	/usr/src/tmp/qt6-tools-buildroot/usr/include/qt6/QtQDocCatchGenerators/catch_generators/generators/k_partition_of_r_generator.h:8:10:
	fatal error: catch/catch.hpp: No such file or directory
	8 | #include <catch/catch.hpp>
	--
	cpp.req: WARNING:
	/usr/src/tmp/qt6-tools-buildroot/usr/include/qt6/QtQDocCatchGenerators/catch_generators/generators/k_partition_of_r_generator.h:
	cpp failed
	/usr/src/tmp/qt6-tools-buildroot/usr/include/qt6/QtQDocCatchGenerators/catch_generators/utilities/semantics/generator_handler.h:8:10:
	fatal error: catch/catch.hpp: No such file or directory
	8 | #include <catch/catch.hpp>
	--
	In file included from
	/usr/src/tmp/qt6-tools-buildroot/usr/include/qt6/QtQDocCatchGenerators/catch_generators/generators/combinators/cycle_generator.h:7:
	/usr/src/tmp/qt6-tools-buildroot/usr/include/qt6/QtQDocCatchGenerators/catch_generators/generators/combinators/../../utilities/semantics/generator_handler.h:8:10:
	fatal error: catch/catch.hpp: No such file or directory
	8 | #include <catch/catch.hpp>

srt-1.5.4-alt1
	[  PASSED  ] 267 tests.
	[  FAILED  ] 1 test, listed below:
	[  FAILED  ] TestFEC.ConnectionForced
	1 FAILED TEST
	YOU HAVE 6 DISABLED TESTS

zstd-1.5.5-alt2
	test206 : ZSTD_adjustCParams() + dictionary OK
	test207 : check compression mem usage monotonicity over levels for estimateCCtxSize() : OK
	test208 : check estimateCCtxSize() always larger or equal to
	ZSTD_estimateCCtxSize_usingCParams() : OK
	test209 : thread pool API tests :
	thread pool test : threadPool re-use roundtrips: OK
	thread pool test : threadPool simultaneous usage: OK
	thread pool tests OK
	1	   
	 3	    
	 16	     
	  19	      
    31	       
    32
	
    35		 
    45	  
    55	   
	56	    
	 60	     
	62	    
	 83	     
	  90	      
    99	       
   106		
   107
	
   116		 
   121	  
   124	   
   129	    
	133	     
	137	     
	 152	      
   167	       
   174		
   175		 
   176
	
   179		 
   185	  
   189	   
   203	    
	205	     
	208	     
	 220	      
   227	       
   231		
   239		 
   240
	
   246		 
   251	  
   261	   
   267	    
	269	     
	276	     
	 290	      
   296	       
   300		
   302		 
   304
	
   313		 
   327	  
   330	   
   335	    
	356	     
	372	     
	 392	      
   399	       
   409		
   421		 
   429
	
   432		 
   437	  
   440	   
   442	    
	447	     
	448	     
	 453	      
   460	       
   473		
   481		 
   493
	
   496		 
   501	  
   510	   
   521	    
	526	     
	527	     
	 533	      
   537	       
   545		
   557		 
   570
	
   585		 
   587	  
   594	   
   595	    
	597	     
	600	     
	 608	      
   609	       
   611		
   620		 
   623
	
   635		 
   646	  
   651	   
   661	    
	678	     
	684	     
	 686	      
   700	       
   710		
   720		 
   741
	
   747		 
   750	  
   751	   
   765	    
	775	     
	785	     
	 793	      
   802	       
   823		
   838		 
   852
	
   857		 
   862	  
   870	   
   888	    
	890	     
	895	     
	 900	      
   902	       
   905		
   909		 
   917
	
   928		 
   947	  
   954	   
   967	    
	970	     
	983	     
	 993	      
  1003	       
  1011		
  1016		 
  1020
	
  1025		 
  1028	  
  1040	   
  1041	    
  1046	     
	1049	      
  1050	       
  1054		
  1061		 
  1069	  
  1083
	
  1090		 
  1091	  
  1099	   
  1101	    
  1109	     
	1114	      
  1116	       
  1118		
  1124		 
  1128	  
  1137
	
  1139		 
  1141	  
  1149	   
  1152	    
  1155	     
	1161	      
  1166	       
  1172		
  1177		 
  1180	  
	1184	      
  1190	       
  1200		
  1208		 
  1217	  
	1219	      
  1235	       
  1238		
  1241		 
  1248	  
	1259	      
  1266	       
  1274		
  1285		 
  1297	  
	1300	      
  1302	       
  1309		
  1320		 
  1342	  
	1348	      
  1355	       
  1364		
  1366		 
  1373	  
	1377	      
  1379	       
  1390		
  1392		 
  1405	  
	1413	      
  1417	       
  1419		
  1431		 
  1447	  
	1455	      
  1460	       
  1467		
  1470		 
  1477	  
	1481	      
  1489	       
  1492		
  1493		 
  1502	  
	1515	      
  1531	       
  1540		
  1548		 
  1550	  
	1556	      
  1567	       
  1576		
  1586		 
  1594	  
	1598	      
  1603	       
  1610		
  1619		 
  1626	  
	1634	      
  1651	       
  1666		
  1667		 
  1670	  
	1678	      
  1683	       
  1690		
  1694		 
  1700	  
  1705
	make: Leaving directory '/usr/src/RPM/BUILD/zstd-1.5.5-alt2/tests'
	make: Target 'test' not remade because of errors.

	10 error logs REMOVED from the list
libgupnp-igd-1.6.0-alt1
libvamp-2.10.0-alt2
ocaml-lsp-1.22.0-alt1
perl-Server-Starter-0.35-alt1.1
python3-module-easyprocess-1.1-alt2
python3-module-loky-3.4.1-alt2
python3-module-mkdocs-1.6.0-alt1
python3-module-pexpect-4.9.0-alt1
sssd-2.9.6-alt3
vulkan-amdgpu-2024.Q2.3-alt1.1

Total 113 error logs.


ðÏÄÒÏÂÎÁÑ ÉÎÆÏÒÍÁÃÉÑ Ï ÓÐÉÓËÅ ÒÁÓÓÙÌËÉ Sisyphus-cybertalk