[cyber] I: p9-20231001 x86_64 beehive_status: +5 -1 (227)

ALT beekeeper hiver на altlinux.org
Вс Окт 1 14:14:08 MSK 2023

	5 NEW error logs

	FAIL: test_logger_dconf.sh
	test_01_write_key_for_known_schema (__main__.TestDconfLogger)
	... DEBUG:fleet_commander_logger.py:Constructing GSettingsLogger
	DEBUG:_logger_test_suite.py:Signal registered. Calling 'Change' dbus method. Args: [[]]
	ERROR:_logger_test_suite.py:Timed out waiting for DBus call. Test probably failed
	test_02_write_key_for_unknown_schema (__main__.TestDconfLogger)
	... DEBUG:fleet_commander_logger.py:Constructing GSettingsLogger
	ERROR: test_01_write_key_for_known_schema (__main__.TestDconfLogger)
	Traceback (most recent call last):
	return self.log.pop(0)
	IndexError: pop from empty list
	Ran 9 tests in 3.113s
	FAILED (errors=1)
	dbus.Array([dbus.String('org.freedesktop.DBus'), dbus.String(':1.3'),
	dbus.String('org.freedesktop.ScreenSaver'), dbus.String('ca.desrt.dconf'),
	dbus.String(':1.1'), dbus.String(':1.2')], signature=dbus.Signature('s'))

	../../../include/vec.h:760:13: warning: 'calc_lll' defined but not used [-Wunused-function]
	static void calc_lll(rvec box,rvec lll)
	In file included from ../../../include/vec.h:121,
	from ../../../src/tools/addconf.c:42:
	../../../include/maths.h:126:1: warning: 'gmx_numzero' defined but not used
	gmx_numzero(double a)
	make[3]: Leaving directory '/usr/src/RPM/BUILD/gromacs-4.0.7/single/src/tools'
	make[2]: *** [Makefile:387: all-recursive] Error 1
	make[1]: *** [Makefile:326: all] Error 2
	make: *** [Makefile:415: all-recursive] Error 1

	ok 3
	ok 4
	ok 5
	ok 6
	ok 7
	ok 8
	ok 9
	Address already in use at test.pl line 38.
	make: *** [Makefile:775: test_dynamic] Error 98
	make: Leaving directory '/usr/src/RPM/BUILD/Net-Shared'

	nose.plugins.cover: INFO: Coverage report will include only packages: ['jupyter_console']
	test that `jupyter console` starts a terminal ... ERROR
	jupyter console --help-all works ... ok
	(jupyter_console.tests.test_image_handler.ZMQTerminalInteractiveShellTestCase) ... ok
	ERROR: test that `jupyter console` starts a terminal
	Traceback (most recent call last):
	Ran 9 tests in 64.074s
	FAILED (errors=1)

	removing 'build/bdist.linux-x86_64/egg' (and everything under it)
	error: [Errno 2] No such file or directory: 'build/bdist.linux-x86_64/egg'
	Adding pycodestyle 2.5.0 to easy-install.pth file
	Finished processing dependencies for pycodestyle==2.5.0
	ERROR: InvocationError for command
	/usr/src/RPM/BUILD/python-module-pycodestyle-2.5.0/.tox/py37/bin/python setup.py install
	(exited with code 1)
	ERROR: invocation failed (exit code 1)
	py27 run-test: commands[1] |
	/usr/src/RPM/BUILD/python-module-pycodestyle-2.5.0/.tox/py27/bin/python pycodestyle.py
	--max-doc-length=72 --testsuite testsuite
	py27: commands succeeded
	ERROR:	 py37: parallel child exit code 1

	1 error log REMOVED from the list

Total 227 error logs.

Подробная информация о списке рассылки Sisyphus-cybertalk