[cyber] I: Sisyphus-20230508 x86_64 beehive_status: +5 -4 (127)

ALT beekeeper hiver на altlinux.org
Пн Май 8 06:56:50 MSK 2023


	5 NEW error logs

liburing-2.3-alt3
	Running test send-zerocopy.t					    can't register
	bufs, skip
	too large non-root buffer registration, skip
	1 sec
	Running test statx.t						    0 sec
	Running test sq-full-cpp.t					    0 sec [0]
	Tests failed (2): <defer-taskrun.t> <xattr.t>
	make[1]: *** [Makefile:231: runtests] Error 1
	make[1]: Leaving directory '/usr/src/RPM/BUILD/liburing-2.3/test'
	make: *** [Makefile:21: runtests] Error 2
	make: Leaving directory '/usr/src/RPM/BUILD/liburing-2.3'

libvamp-2.10.0-alt1
	ld: ./libvamp-hostsdk.a: error adding symbols: no more archived files
	collect2: error: ld returned 1 exit status
	make: *** [Makefile:271: rdf/generator/vamp-rdf-template-generator] Error 1

lightdm-1.32.0-alt2
	PASS: test-session-greeter-autologin
	FAIL: test-session-greeter-reconnect
	PASS: test-session-greeter-unlock
	--
	# SKIP:  0
	# XFAIL: 0
	# FAIL:  1
	# XPASS: 0
	# ERROR: 0
	See tests/test-suite.log

meschach-1.2-alt1.b.3
	ld: meschach.a: member meschach.a(copy.o) in archive is not an object
	collect2: error: ld returned 1 exit status

postfix-1:3.6.6-alt1
	make -f Makefile.in MAKELEVEL= Makefiles
	make: Entering directory '/usr/src/RPM/BUILD/postfix-3.6.6/postfix-3.6.6'
	(echo "# Do not edit -- this file documents how Postfix was built for your machine.";
	/bin/sh makedefs) >makedefs.tmp
	ATTENTION:
	ATTENTION: Unknown system type: Linux 6.1.27-std-def-alt1
	ATTENTION:
	make: *** [Makefile.in:32: Makefiles] Error 1
	make: Leaving directory '/usr/src/RPM/BUILD/postfix-3.6.6/postfix-3.6.6'
	make: *** [Makefile:22: Makefiles] Error 2
	make: Leaving directory '/usr/src/RPM/BUILD/postfix-3.6.6/postfix-3.6.6'

	4 error logs REMOVED from the list
cataclysm-dda-0.F.3-alt3
codeblocks-20.03-alt9
python3-module-hupper-1.0-alt2
qemu-8.0.0-alt2

Total 127 error logs.


Подробная информация о списке рассылки Sisyphus-cybertalk