[cyber] I: Sisyphus-20230505 x86_64 beehive_status: +4 -5 (125)

ALT beekeeper hiver на altlinux.org
Пт Май 5 07:46:39 MSK 2023


	4 NEW error logs

aubuild-source-0.1.1-alt2
	reading sources... [100%] modules
	/usr/src/RPM/BUILD/aubuild-0.1.1/python/aubuild/base.py:docstring of aubuild.base:1:
	ERROR: Unknown interpreted text role "member".
	/usr/src/RPM/BUILD/aubuild-0.1.1/python/aubuild/base.py:docstring of
	aubuild.base.AbstractAuditEvent:1: ERROR: Unknown interpreted text role "member".
	/usr/src/RPM/BUILD/aubuild-0.1.1/python/aubuild/base.py:docstring of aubuild.base:1:
	ERROR: Unknown interpreted text role "member".
	/usr/src/RPM/BUILD/aubuild-0.1.1/python/aubuild/base.py:docstring of
	aubuild.base.AbstractAuditEvent:1: ERROR: Unknown interpreted text role "member".
	/usr/src/RPM/BUILD/aubuild-0.1.1/python/aubuild/base.py:docstring of aubuild.base:1:
	ERROR: Unknown interpreted text role "member".
	/usr/src/RPM/BUILD/aubuild-0.1.1/python/aubuild/base.py:docstring of
	aubuild.base.AbstractAuditEvent:1: ERROR: Unknown interpreted text role "member".
	/usr/src/RPM/BUILD/aubuild-0.1.1/python/aubuild/base.py:docstring of
	aubuild.base.AbstractAuditEvent:3: ERROR: Unknown interpreted text role "member".
	/usr/src/RPM/BUILD/aubuild-0.1.1/python/aubuild/base.py:docstring of
	aubuild.base.AbstractAuditEvent:1: ERROR: Unknown interpreted text role "member".
	/usr/src/RPM/BUILD/aubuild-0.1.1/python/aubuild/base.py:docstring of
	aubuild.base.AbstractAuditEvent:3: ERROR: Unknown interpreted text role "member".
	/usr/src/RPM/BUILD/aubuild-0.1.1/python/aubuild/base.py:docstring of aubuild.base:1:
	ERROR: Unknown interpreted text role "member".
	/usr/src/RPM/BUILD/aubuild-0.1.1/python/aubuild/base.py:docstring of
	aubuild.base.AbstractAuditEvent:1: ERROR: Unknown interpreted text role "member".

litmus-0.14.0-alt2.git.9fbc73d
	checking for a BSD-compatible install... /bin/install -c
	./configure: line 2846: syntax error near unexpected token `0,'
	./configure: line 2846: `NE_REQUIRE_VERSIONS(0, 26 27 28 29 30 31 32)'

openmotif-2.3.8-alt1
	../../../clients/uil/uil -o hellomotif.uid hellomotif.uil -I./../../../clients/uil
	-I../../../clients/uil
	make[3]: *** [Makefile:646: hellomotif.uid] Segmentation fault
	make[3]: Leaving directory '/usr/src/RPM/BUILD/openmotif-2.3.8/demos/programs/hellomotif'
	make[3]: *** Waiting for unfinished jobs....
	make[3]: Entering directory '/usr/src/RPM/BUILD/openmotif-2.3.8/demos/programs/hellomotif'
	x86_64-alt-linux-gcc -DHAVE_CONFIG_H -I. -I../../../include -I../../../lib/Xm
	-I./../../../lib -I../../../lib    -I/usr/include/freetype2 -I/usr/include/libpng16
	-I/usr/include/harfbuzz -I/usr/include/glib-2.0 -I/usr/lib64/glib-2.0/include
	-I/usr/include/freetype2 -I/usr/include/libpng16 -I/usr/include/harfbuzz
	-I/usr/include/glib-2.0 -I/usr/lib64/glib-2.0/include  -pipe -frecord-gcc-switches
	-Wall -g -O2 -flto=auto  -Wall -g -fno-strict-aliasing -Wno-unused -Wno-comment
	-I/usr/include/freetype2 -I/usr/include/libpng16 -I/usr/include/harfbuzz
	-I/usr/include/glib-2.0 -I/usr/lib64/glib-2.0/include	-c hellomotif.c
	make[3]: Leaving directory '/usr/src/RPM/BUILD/openmotif-2.3.8/demos/programs/hellomotif'
	make[2]: *** [Makefile:358: all-recursive] Error 1
	make[1]: *** [Makefile:325: all-recursive] Error 1
	make: *** [Makefile:380: all-recursive] Error 1

python3-module-tornado-6.3.1-alt1
	test_simple (tornado.test.wsgi_test.WSGIContainerThreadPoolTest) ... ok
	FAIL: test_connection_refused (tornado.test.iostream_test.TestIOStream)
	Traceback (most recent call last):
	--
	with self.assertRaises(StreamClosedError):
	AssertionError: StreamClosedError not raised
	Ran 1189 tests in 19.540s
	FAILED (failures=1, skipped=53)
	Some tests were skipped because: localhost does not resolve to ipv6,

	5 error logs REMOVED from the list
erlang-proper-1.4.0.19.3bbd-alt1
perl-Gearman-2.004.015-alt1_5
python3-module-easyprocess-1.1-alt1
python3-module-pytest-rerunfailures-10.2-alt1
python3-module-uvicorn-0.20.0-alt1

Total 125 error logs.


Подробная информация о списке рассылки Sisyphus-cybertalk