[cyber] I: Sisyphus-20230321 x86_64 beehive_status: +3 -6 (83)
ALT beekeeper
hiver на altlinux.org
Вт Мар 21 06:44:05 MSK 2023
3 NEW error logs
R-base-4.1.3-alt1
checking if libcurl is version 7 and >= 7.28.0... no
configure: error: libcurl >= 7.28.0 library and headers are required with support for https
fprintd-1.94.2-alt1
Full log written to
/usr/src/RPM/BUILD/fprintd-1.94.2/x86_64-alt-linux/meson-logs/testlog.txt
FAILED: meson-internal__test
/usr/bin/meson test --no-rebuild --print-errorlogs
perl-Business-ISBN-3.007-alt1
t/constants.t ............ ok
# Failed test 'ISBN 9786316294241 error text mentions 'group''
# at t/errors.t line 17.
--
# doesn't match '(?^:group)'
# Failed test 'ISBN 9786316294241 has a bad group'
# at t/errors.t line 18.
# Failed test 'ISBN 6316294247 error text mentions 'group''
# at t/errors.t line 17.
--
# doesn't match '(?^:group)'
# Failed test 'ISBN 6316294247 has a bad group'
# at t/errors.t line 18.
# Looks like you failed 4 tests of 11.
# Failed test 'bad_group'
# at t/errors.t line 28.
--
t/errors.t (Wstat: 256 Tests: 4 Failed: 1)
Failed test: 3
Non-zero exit status: 1
--
Result: FAIL
Failed 1/12 test programs. 1/128 subtests failed.
make: *** [Makefile:778: test_dynamic] Error 255
6 error logs REMOVED from the list
libfprint2-1.94.5-alt1
libvamp-2.10.0-alt1
lightdm-kde-greeter-0.4.6-alt1
meschach-1.2-alt1.b.3
python3-module-mdp-3.6-alt1
python3-module-pytest-xdist-2.5.0-alt1
Total 83 error logs.
Подробная информация о списке рассылки Sisyphus-cybertalk