[cyber] I: p9-20220918 x86_64 beehive_status: +6 -6 (262)
ALT beekeeper
hiver на altlinux.org
Вс Сен 18 12:13:27 MSK 2022
6 NEW error logs
SNNS-4.3-alt1.1.1.1
/usr/bin/ld.default: ../../kernel/sources/libkernel.a(kr_newpattern.o): in function
`kr_npui_setCurrPatSet':
/usr/src/RPM/BUILD/SNNSv4.3/kernel/sources/kr_newpattern.c:135: undefined reference to
`newPatternsLoaded'
/usr/bin/ld.default: ../../kernel/sources/libkernel.a(kr_newpattern.o): in function
`kr_npui_loadNewPatterns':
/usr/src/RPM/BUILD/SNNSv4.3/kernel/sources/kr_newpattern.c:582: undefined reference to
`newPatternsLoaded'
/usr/bin/ld.default: ../../kernel/sources/libfunc.a(update_f.o): in function
`UPDATE_DLVQ_Propagate':
/usr/src/RPM/BUILD/SNNSv4.3/kernel/sources/update_f.c:1479: undefined reference to
`newPatternsLoaded'
/usr/bin/ld.default: /usr/src/RPM/BUILD/SNNSv4.3/kernel/sources/update_f.c:1508:
undefined reference to `allocArrays'
/usr/bin/ld.default: /usr/src/RPM/BUILD/SNNSv4.3/kernel/sources/update_f.c:1512:
undefined reference to `dlvq_setPointers'
/usr/bin/ld.default: /usr/src/RPM/BUILD/SNNSv4.3/kernel/sources/update_f.c:1520:
undefined reference to `generateMissingClassHiddenUnits'
/usr/bin/ld.default: /usr/src/RPM/BUILD/SNNSv4.3/kernel/sources/update_f.c:1484:
undefined reference to `getNoOfClasses'
/usr/bin/ld.default: /usr/src/RPM/BUILD/SNNSv4.3/kernel/sources/update_f.c:1487:
undefined reference to `normPatterns'
/usr/bin/ld.default: /usr/src/RPM/BUILD/SNNSv4.3/kernel/sources/update_f.c:1488:
undefined reference to `allocInitialUnitArray'
/usr/bin/ld.default: /usr/src/RPM/BUILD/SNNSv4.3/kernel/sources/update_f.c:1489:
undefined reference to `initInitialUnitArray'
/usr/bin/ld.default: libxgui1.a(ui_controlP.o): in function `ui_rem_modifyPatternProc':
fleet-commander-admin-0.15.1-alt4.M90P.1
<30>Sep 18 08:31:35 dbus-daemon[1620310]: [session uid=979 pid=1620295] Successfully
activated service 'ca.desrt.dconf'
FAIL: test_logger_dconf.sh
PASS: test_logger_connmgr.py
--
# SKIP: 0
# XFAIL: 0
# FAIL: 1
# XPASS: 0
# ERROR: 0
See tests/test-suite.log
--
# SKIP: 0
# XFAIL: 0
# FAIL: 1
# XPASS: 0
# ERROR: 0
.. contents:: :depth: 2
FAIL: test_logger_dconf.sh
test_01_write_key_for_known_schema (__main__.TestDconfLogger)
... DEBUG:fleet_commander_logger.py:Constructing GSettingsLogger
--
DEBUG:_logger_test_suite.py:Signal registered. Calling 'ChangeCommon' dbus method. Args: []
ERROR:_logger_test_suite.py:Timed out waiting for DBus call. Test probably failed
ok
--
DEBUG:fleet_commander_logger.py:Adding schema /test/: fleet-commander-test
ERROR:_logger_test_suite.py:Timed out waiting for DBus call. Test probably failed
ERROR
kaptain-0.73-alt1
g++ -c -pipe -frecord-gcc-switches -Wall -g -O2 -DPIC -fPIC -O2 -D_REENTRANT -Wall -W
-DQT_WEBKIT -DQT_NO_DEBUG -DQT_QT3SUPPORT_LIB -DQT3_SUPPORT -DQT_GUI_LIB -DQT_CORE_LIB
-DQT_SHARED -I../../../../share/qt4/mkspecs/linux-g++ -I. -I../../../../include/qt4/QtCore
-I../../../../include/qt4/QtGui -I../../../../include/qt4/Qt3Support
-I../../../../include/qt4 -I. -o lexer_lex.o lexer_lex.cpp
lexer.lpp:8:10: fatal error: parser_yacc.h: No such file or directory
#include "parser_yacc.h"
perl-IO-Event-0.813-alt2
Result: FAIL
Failed 1/12 test programs. 0/920 subtests failed.
make: *** [Makefile:780: test_dynamic] Error 255
python-module-pebble-4.3.7-alt1.git20180228
collecting ... collected 41 items
test/test_process_pool_spawn.py::TestProcessPool::test_process_pool_broken_initializer
FAILED [ 2%]
test/test_process_pool_spawn.py::TestProcessPool::test_process_pool_callback PASSED [ 4%]
--
> pool.schedule(function)
E AssertionError: RuntimeError not raised
test/test_process_pool_spawn.py:212: AssertionError
----------------------------- Captured stderr call -----------------------------
ERROR:root:BOOM!
Traceback (most recent call last):
--
Exception: BOOM!
ERROR:root:BOOM!
Traceback (most recent call last):
--
Exception: BOOM!
ERROR:root:BOOM!
Traceback (most recent call last):
--
Exception: BOOM!
ERROR:root:BOOM!
Traceback (most recent call last):
--
Exception: BOOM!
ERROR:root:BOOM!
Traceback (most recent call last):
--
Exception: BOOM!
ERROR:root:BOOM!
Traceback (most recent call last):
--
Exception: BOOM!
ERROR:root:BOOM!
Traceback (most recent call last):
--
Exception: BOOM!
ERROR:root:BOOM!
Traceback (most recent call last):
sbcl-1.4.12-alt3
21 0 0.0 1856 100.0 1856 100.0 - (FLET SB-UNIX::BODY :IN
SAVE-LISP-AND-DIE)
22 0 0.0 1856 100.0 1856 100.0 - (FLET "WITHOUT-INTERRUPTS-BODY-27"
:IN SAVE-LISP-AND-DIE)
23 0 0.0 1856 100.0 1856 100.0 - (LABELS SB-IMPL::RESTART-LISP :IN
SAVE-LISP-AND-DIE)
24 0 0.0 197 10.6 1856 100.0 - "foreign function
interrupt_handle_pending"
25 0 0.0 197 10.6 1856 100.0 - "foreign function handle_trap"
0 0.0 elsewhere
* make: Leaving directory '/usr/src/RPM/BUILD/sbcl-1.4.12/sbcl-1.4.12/contrib/sb-sprof'
WARNING! Some of the contrib modules did not build successfully or pass
their self-tests. Failed contribs:"
sb-concurrency
6 error logs REMOVED from the list
compiz-0.9.14.1-alt1
dopewars-1.5.12-alt1_20.1033svn
perl-HTTP-Proxy-0.304-alt2
php7-7.3.33-alt1
python-module-jupyter_console-5.2.0-alt1.1
quilt-0.66-alt1
Total 262 error logs.
Подробная информация о списке рассылки Sisyphus-cybertalk