[cyber] I: p10-20220529 x86_64 beehive_status: +5 -7 (35)
ALT beekeeper
hiver на altlinux.org
Вс Май 29 05:52:25 MSK 2022
5 NEW error logs
SNNS-4.3-alt1.1.1.1
ld: ../../kernel/sources/libfunc.a(stochastic_learn_f.o): in function `LEARN_MonteCarlo':
/usr/src/RPM/BUILD/SNNSv4.3/kernel/sources/stochastic_learn_f.c:133: undefined reference
to `propagateNetForward'
ld: ../../kernel/sources/libfunc.a(stochastic_learn_f.o): in function `TEST_MonteCarlo':
/usr/src/RPM/BUILD/SNNSv4.3/kernel/sources/stochastic_learn_f.c:217: undefined reference
to `propagateNetForward'
ld: ../../kernel/sources/libfunc.a(stochastic_learn_f.o): in function
`LEARN_SimulatedAnnealing':
/usr/src/RPM/BUILD/SNNSv4.3/kernel/sources/stochastic_learn_f.c:615: undefined reference
to `propagateNetForward'
ld: ../../kernel/sources/libfunc.a(stochastic_learn_f.o): in function
`TEST_SimulatedAnnealing':
/usr/src/RPM/BUILD/SNNSv4.3/kernel/sources/stochastic_learn_f.c:778: undefined reference
to `propagateNetForward'
ld: ../../kernel/sources/libfunc.a(scaled_conj_grad.o): in function `compute_gradient':
/usr/src/RPM/BUILD/SNNSv4.3/kernel/sources/scaled_conj_grad.c:476: undefined reference to
`propagateNetForward'
ld: /usr/src/RPM/BUILD/SNNSv4.3/kernel/sources/scaled_conj_grad.c:478: undefined
reference to `propagateNetBackwardBatch'
ld: /usr/src/RPM/BUILD/SNNSv4.3/kernel/sources/scaled_conj_grad.c:464: undefined
reference to `clearDeltas'
ld: ../../kernel/sources/libfunc.a(scaled_conj_grad.o): in function `TEST_SCG':
/usr/src/RPM/BUILD/SNNSv4.3/kernel/sources/scaled_conj_grad.c:508: undefined reference to
`TEST_backprop'
collect2: error: ld returned 1 exit status
make[1]: *** [Makefile:189: td_bignet] Error 1
gem-friendly-id-5.4.1-alt1
fatal: not a git repository (or any of the parent directories): .git
/usr/lib/ruby/fileutils.rb:877:in `stat': No such file or directory @ rb_file_s_stat -
/usr/src/tmp/Gemfile.20220529-2287379-1qw2wd7 (Errno::ENOENT)
from /usr/lib/ruby/fileutils.rb:877:in `block in install'
ipmiutil-3.1.3-alt2
ld: ipmi_sample.o: in function `main':
/usr/src/RPM/BUILD/ipmiutil-3.1.3/util/ipmi_sample.c:162: undefined reference to
`print_lan_opt_usage'
ld: /usr/src/RPM/BUILD/ipmiutil-3.1.3/util/ipmi_sample.c:150: undefined reference to
`parse_lan_options'
ld: /usr/src/RPM/BUILD/ipmiutil-3.1.3/util/ipmi_sample.c:121: undefined reference to `htoi'
ld: /usr/src/RPM/BUILD/ipmiutil-3.1.3/util/ipmi_sample.c:122: undefined reference to `htoi'
ld: /usr/src/RPM/BUILD/ipmiutil-3.1.3/util/ipmi_sample.c:123: undefined reference to `htoi'
ld: /usr/src/RPM/BUILD/ipmiutil-3.1.3/util/ipmi_sample.c:129: undefined reference to
`ipmi_set_mc'
ld: /usr/src/RPM/BUILD/ipmiutil-3.1.3/util/ipmi_sample.c:167: undefined reference to
`get_BiosVersion'
ld: /usr/src/RPM/BUILD/ipmiutil-3.1.3/util/ipmi_sample.c:195: undefined reference to
`parse_lan_options'
ld: /usr/src/RPM/BUILD/ipmiutil-3.1.3/util/ipmi_sample.c:196: undefined reference to
`parse_lan_options'
ld: /usr/src/RPM/BUILD/ipmiutil-3.1.3/util/ipmi_sample.c:197: undefined reference to
`parse_lan_options'
ld: /usr/src/RPM/BUILD/ipmiutil-3.1.3/util/ipmi_sample.c:198: undefined reference to
`parse_lan_options'
litmus-0.14.0-alt1.git.9fbc73d
checking for a BSD-compatible install... /bin/install -c
./configure: line 2846: syntax error near unexpected token `0,'
./configure: line 2846: `NE_REQUIRE_VERSIONS(0, 26 27 28 29 30 31)'
perl-Test-LectroTest-0.5001-alt3
t/docs-eg.t ............... ok
# Failed test 'Int(sized=>0,range=>[-5,4]) is complete and uniformly distributed'
# at /usr/share/perl5/Test/More.pm line 323.
--
t/gens.t (Wstat: 256 Tests: 248 Failed: 1)
Failed test: 97
Non-zero exit status: 1
--
Result: FAIL
Failed 1/12 test programs. 1/343 subtests failed.
make: *** [Makefile:783: test_dynamic] Error 255
7 error logs REMOVED from the list
automake_1.11-1.11.6-alt9
fleet-commander-admin-0.15.1-alt8
libredland-1.0.17-alt3
libxfce4util-4.16.0-alt1
perl-POE-Component-IRC-6.93-alt1
proftpd-1.3.6-alt0.4.ga73dbfe3b
pybind11-2.6.2-alt2
Total 35 error logs.
Подробная информация о списке рассылки Sisyphus-cybertalk