[cyber] I: p9-20220501 x86_64 beehive_status: +37 -21 (256)
ALT beekeeper
hiver на altlinux.org
Вс Май 1 11:48:46 MSK 2022
37 NEW error logs
apache-commons-lang-0:2.6-alt5_22jpp8
[ERROR] testNextFloat2(org.apache.commons.lang.math.RandomUtilsTest) Time elapsed:
0.005 s <<< FAILURE!
junit.framework.AssertionFailedError: chi-square test -- will fail about 1 in 1000 times
at junit.framework.Assert.fail(Assert.java:57)
eid-mw-4.4.13-alt1
Building Dependency Tree...
E: Couldn't find package rpm-build-firefox
hsh-install: Failed to calculate package file list.
firefox-TabMixPlus-0.4.1.7.1-alt1
Building Dependency Tree...
E: Couldn't find package rpm-build-firefox
hsh-install: Failed to calculate package file list.
firefox-adblock_plus-2.7.3-alt1
Building Dependency Tree...
E: Couldn't find package rpm-build-firefox
hsh-install: Failed to calculate package file list.
firefox-betterprivacy-1.77-alt1
Building Dependency Tree...
E: Couldn't find package rpm-build-firefox
hsh-install: Failed to calculate package file list.
firefox-certificate_patrol-2.0.16-alt1
Building Dependency Tree...
E: Couldn't find package rpm-build-firefox
hsh-install: Failed to calculate package file list.
firefox-copyallurls-0.9.8-alt2
Building Dependency Tree...
E: Couldn't find package rpm-build-firefox
hsh-install: Failed to calculate package file list.
firefox-deepdark-10.3.8-alt1
Building Dependency Tree...
E: Couldn't find package rpm-build-firefox
hsh-install: Failed to calculate package file list.
firefox-download_statusbar-0.9.10-alt2
Building Dependency Tree...
E: Couldn't find package rpm-build-firefox
hsh-install: Failed to calculate package file list.
firefox-duckduckgo_plus-2017.12.7-alt1
Building Dependency Tree...
E: Couldn't find package rpm-build-firefox
hsh-install: Failed to calculate package file list.
firefox-esr-noscript-5.1.8.4-alt2
Building Dependency Tree...
E: Couldn't find package rpm-build-firefox
hsh-install: Failed to calculate package file list.
firefox-firebug-1:2.0.16-alt1
Building Dependency Tree...
E: Couldn't find package rpm-build-firefox
hsh-install: Failed to calculate package file list.
firefox-flashblock-1.5.20-alt1
Building Dependency Tree...
E: Couldn't find package rpm-build-firefox
hsh-install: Failed to calculate package file list.
firefox-flashgot-1.5.5.94-alt1
Building Dependency Tree...
E: Couldn't find package rpm-build-firefox
hsh-install: Failed to calculate package file list.
firefox-foxyproxy_standard-6.1.9-alt1.qa1
Building Dependency Tree...
E: Couldn't find package rpm-build-firefox
hsh-install: Failed to calculate package file list.
firefox-gismeteo-5.0.0.6-alt2.1
Building Dependency Tree...
E: Couldn't find package rpm-build-firefox
hsh-install: Failed to calculate package file list.
firefox-gmail_manager-0.7.0.1-alt1
Building Dependency Tree...
E: Couldn't find package rpm-build-firefox
hsh-install: Failed to calculate package file list.
firefox-gnome_shell_integration-10.1-alt1
Building Dependency Tree...
E: Couldn't find package rpm-build-firefox
hsh-install: Failed to calculate package file list.
firefox-hybridfox-1.7.000119-alt5
Building Dependency Tree...
E: Couldn't find package rpm-build-firefox
hsh-install: Failed to calculate package file list.
firefox-livejournal_addons-9.5-alt4
Building Dependency Tree...
E: Couldn't find package rpm-build-firefox
hsh-install: Failed to calculate package file list.
firefox-morpheus-0.2.6.1.1-alt1
Building Dependency Tree...
E: Couldn't find package rpm-build-firefox
hsh-install: Failed to calculate package file list.
firefox-noscript-10.1.7.2-alt2
Building Dependency Tree...
E: Couldn't find package rpm-build-firefox
hsh-install: Failed to calculate package file list.
firefox-privacy_settings-0.2.6-alt1
Building Dependency Tree...
E: Couldn't find package rpm-build-firefox
hsh-install: Failed to calculate package file list.
firefox-quicknote-0.7.6-alt1
Building Dependency Tree...
E: Couldn't find package rpm-build-firefox
hsh-install: Failed to calculate package file list.
firefox-r-kiosk-0.9.0.1-alt2
Building Dependency Tree...
E: Couldn't find package rpm-build-firefox
hsh-install: Failed to calculate package file list.
firefox-righttoclick-2.9.6-alt1
Building Dependency Tree...
E: Couldn't find package rpm-build-firefox
hsh-install: Failed to calculate package file list.
firefox-scrapbook-1.5.14-alt1
Building Dependency Tree...
E: Couldn't find package rpm-build-firefox
hsh-install: Failed to calculate package file list.
firefox-sessionmanager-0.8.1.13-alt1
Building Dependency Tree...
E: Couldn't find package rpm-build-firefox
hsh-install: Failed to calculate package file list.
firefox-ublock_origin-1.14.22-alt1
Building Dependency Tree...
E: Couldn't find package rpm-build-firefox
hsh-install: Failed to calculate package file list.
firefox-umatrix-1.1.20-alt1
Building Dependency Tree...
E: Couldn't find package rpm-build-firefox
hsh-install: Failed to calculate package file list.
firefox-video_downloadhelper-7.1.1-alt1
Building Dependency Tree...
E: Couldn't find package rpm-build-firefox
hsh-install: Failed to calculate package file list.
firefox-vkontaktetoolbar-0.6.1-alt1
Building Dependency Tree...
E: Couldn't find package rpm-build-firefox
hsh-install: Failed to calculate package file list.
firefox-yandexbar-7.9-alt1
Building Dependency Tree...
E: Couldn't find package rpm-build-firefox
hsh-install: Failed to calculate package file list.
mozilla-plugin-java-1.8.0-openjdk-1.8-alt1_2jpp8
Building index for all classes...
Generating /usr/src/RPM/BUILD/icedtea-web-1.8/docs/netx/allclasses-frame.html...
Generating /usr/src/RPM/BUILD/icedtea-web-1.8/docs/netx/allclasses-noframe.html...
Generating /usr/src/RPM/BUILD/icedtea-web-1.8/docs/netx/index.html...
Generating /usr/src/RPM/BUILD/icedtea-web-1.8/docs/netx/overview-summary.html...
Generating /usr/src/RPM/BUILD/icedtea-web-1.8/docs/netx/help-doc.html...
11 warnings
mkdir -p stamps
touch stamps/netx-docs.stamp
make: Leaving directory '/usr/src/RPM/BUILD/icedtea-web-1.8'
opendx-4.4.4-alt8
x86_64-alt-linux-gcc -E -I../../../include -I./../dpexec
-I/usr/src/RPM/BUILD/opendx-4.4.4/include -Dlinux -DHAVE_CONFIG_H -DCPLUSPLUS_UI
-DEXECUTIVE_MODS tmp.c > dx.mdf
cc1: fatal error: tmp.c: No such file or directory
compilation terminated.
python-module-pycodestyle-2.5.0-alt1
Extracting pycodestyle-2.5.0-py3.7.egg to
/usr/src/RPM/BUILD/python-module-pycodestyle-2.5.0/.tox/py37/lib/python3/site-packages
error: [Errno 2] No such file or directory: 'build/bdist.linux-x86_64/egg/pycodestyle.pyc'
Adding pycodestyle 2.5.0 to easy-install.pth file
--
Finished processing dependencies for pycodestyle==2.5.0
ERROR: InvocationError for command
/usr/src/RPM/BUILD/python-module-pycodestyle-2.5.0/.tox/py27/bin/python setup.py install
(exited with code 1)
py37 run-test: commands[1] |
/usr/src/RPM/BUILD/python-module-pycodestyle-2.5.0/.tox/py37/bin/python pycodestyle.py
--max-doc-length=72 --testsuite testsuite
ERROR: invocation failed (exit code 1)
[1473976] /usr/src/RPM/BUILD/python-module-pycodestyle-2.5.0$
/usr/src/RPM/BUILD/python-module-pycodestyle-2.5.0/.tox/py37/bin/python pycodestyle.py
--max-doc-length=72 --testsuite testsuite
--
___________________________________ summary ____________________________________
ERROR: py27: parallel child exit code 1
py37: commands succeeded
tarantool-2.8.3-alt1
[Internal test-run error] The following tasks were dispatched to some worker task queue,
but were not reported as done (does not matters success or fail):
- [replication-py/conflict.test.py, null]
make[3]: *** [test/CMakeFiles/test-force.dir/build.make:57: test/CMakeFiles/test-force]
Error 4
make[3]: Leaving directory '/usr/src/RPM/BUILD/tarantool-2.8.3'
make[2]: *** [CMakeFiles/Makefile2:5611: test/CMakeFiles/test-force.dir/all] Error 2
make[2]: Leaving directory '/usr/src/RPM/BUILD/tarantool-2.8.3'
make[1]: *** [CMakeFiles/Makefile2:5618: test/CMakeFiles/test-force.dir/rule] Error 2
make[1]: Leaving directory '/usr/src/RPM/BUILD/tarantool-2.8.3'
make: *** [Makefile:2058: test-force] Error 2
make: Leaving directory '/usr/src/RPM/BUILD/tarantool-2.8.3'
21 error logs REMOVED from the list
automake_1.11-1.11.6-alt9
cilk-5.4.6-alt11
font-manager-0.7.5-alt2
fsharp-10.2.1-alt3
hyena-0.5-alt3
keepass-2.45-alt1
libappindicator-12.10.0-alt11
libgnome-sharp-2.24.2-alt6
libgtk-sharp2-2.12.11-alt7
libkarma-0.1.2-alt1_9
monodevelop-7.6.9.22-alt3
msbuild-15.6-alt1.S1.2018.01.17.14.14
ncmpc-0.31-alt1
pdfmod-0.9.1-alt10
perl-IO-Event-0.813-alt2
php7-7.3.33-alt1
pinta-1.6-alt3.S1
proftpd-1.3.6-alt0.4.ga73dbfe3b
referenceassemblies-pcl-2014.04.14-alt5
sbcl-1.4.12-alt3
xsp-4.4-alt5.S1
Total 256 error logs.
Подробная информация о списке рассылки Sisyphus-cybertalk